The mobile packages error reporting

Configure project :react-native-webview
:react-native-webview:reactNativeAndroidRoot F:\jitsi-meet-3600\node_modules\react-native\android

Task :app:runDebugReactPackager FAILED
Starting the React packager…

Deprecated Gradle features were used in this build, making it incompatible with Gradle 5.0.
Use ‘–warning-mode all’ to show the individual deprecation warnings.
See https://docs.gradle.org/4.10.1/userguide/command_line_interface.html#sec:command_line_warnings
201 actionable tasks: 7 executed, 194 up-to-date

FAILURE: Build failed with an exception.

  • What went wrong:
    Execution failed for task ‘:app:runDebugReactPackager’.

A problem occurred starting process ‘command ‘scripts/run-packager.sh’’

  • Try:
    Run with --stacktrace option to get the stack trace. Run with --info or --debug option to get more log output. Run with --scan to get full insights.

  • Get more help at https://help.gradle.org

BUILD FAILED in 34s

error Failed to install the app. Make sure you have the Android development environment set up: https://facebook.github.io/react-native/docs/getting-started.html#android-development-environment. Run CLI with --verbose flag for more details.
Error: Command failed: gradlew.bat app:installDebug -PreactNativeDevServerPort=8081

FAILURE: Build failed with an exception.

  • What went wrong:
    Execution failed for task ‘:app:runDebugReactPackager’.

A problem occurred starting process ‘command ‘scripts/run-packager.sh’’

  • Try:
    Run with --stacktrace option to get the stack trace. Run with --info or --debug option to get more log output. Run with --scan to get full insights.

  • Get more help at https://help.gradle.org

BUILD FAILED in 34s

at checkExecSyncError (child_process.js:629:11)
at execFileSync (child_process.js:647:13)
at runOnAllDevices (F:\jitsi-meet-3600\node_modules\@react-native-community\cli-platform-android\build\commands\runAndroid\runOnAllDevices.js:74:39)
at buildAndRun (F:\jitsi-meet-3600\node_modules\@react-native-community\cli-platform-android\build\commands\runAndroid\index.js:158:41)
at then.result (F:\jitsi-meet-3600\node_modules\@react-native-community\cli-platform-android\build\commands\runAndroid\index.js:125:12)
at process._tickCallback (internal/process/next_tick.js:68:7)

F:\jitsi-meet-3600>

We don’t support building on Windows, sorry.

Android apk is packaged on what operating system?

We support macOS and GNU/Linux.