Make command error

Hi @saghul @damencho ,

I am trying to implement the changes I made for room name change by using the make command. However this is the error message

root@sparksoft:/home/ubuntu/jitsi-meet# make
./node_modules/.bin/webpack -p

Insufficient number of arguments or no entry found.
Alternatively, run 'webpack(-cli) --help' for usage info.

Hash: 20c1ebf67589371c73e6
Version: webpack 4.27.1
Time: 76ms
Built at: 05/23/2020 7:43:27 PM

ERROR in Entry module not found: Error: Can't resolve './src' in '/usr/share/jitsi-meet'
Makefile:19: recipe for target 'compile' failed
make: *** [compile] Error 2```

UPDATE:

I am able to use the make command but changes in roomNameGenerator is not yet taking effect. Here is the error after running npm update and make. I used make dev as advised in this topic (Build from code and install).

./node_modules/.bin/webpack -p
make: ./node_modules/.bin/webpack: Command not found
Makefile:19: recipe for target 'compile' failed
make: *** [compile] Error 127
root@sparksoft:/home/ubuntu/jitsi-meet# make dev
rm -fr libs
mkdir -p libs
./node_modules/.bin/node-sass css/main.scss css/all.bundle.css && \
./node_modules/.bin/cleancss css/all.bundle.css > css/all.css ; \
rm css/all.bundle.css
/bin/sh: 1: ./node_modules/.bin/node-sass: not found
rm: cannot remove 'css/all.bundle.css': No such file or directory
Makefile:75: recipe for target 'deploy-css' failed
make: *** [deploy-css] Error 1```