Jitsi Torture - Chrome problems

Hi,

i have some problems with my new installed Jitsi-Torture setup and i hope you can give me some hints. I think there is a problem with the google-chrome-webdriver.
Some tests with google-chrome options “–no-sandbox” or “–disable-dev-shm-usage” didn’t help.

Thanks for support.

WARNING: An illegal reflective access operation has occurred
WARNING: Illegal reflective access by com.google.inject.internal.cglib.core.$ReflectUtils$1 (file:/usr/share/maven/lib/guice.jar) to method java.lang.ClassLoader.defineClass(java.lang.String,byte[],int,int,java.security.ProtectionDomain)
WARNING: Please consider reporting this to the maintainers of com.google.inject.internal.cglib.core.$ReflectUtils$1
WARNING: Use --illegal-access=warn to enable warnings of further illegal reflective access operations
WARNING: All illegal access operations will be denied in a future release
[INFO] Scanning for projects...
WARNING: An illegal reflective access operation has occurred
WARNING: Illegal reflective access by com.google.inject.internal.cglib.core.$ReflectUtils$1 (file:/usr/share/maven/lib/guice.jar) to method java.lang.ClassLoader.defineClass(java.lang.String,byte[],int,int,java.security.ProtectionDomain)
WARNING: Please consider reporting this to the maintainers of com.google.inject.internal.cglib.core.$ReflectUtils$1
WARNING: Use --illegal-access=warn to enable warnings of further illegal reflective access operations
WARNING: All illegal access operations will be denied in a future release
[INFO] Scanning for projects...
[INFO]
[INFO] --------------------< org.jitsi:jitsi-meet-torture >--------------------
[INFO] Building jitsi-meet-torture 1.0-SNAPSHOT
[INFO] --------------------------------[ jar ]---------------------------------
[INFO]
[INFO] --- maven-resources-plugin:2.6:resources (default-resources) @ jitsi-meet-torture ---
[INFO] Using 'UTF-8' encoding to copy filtered resources.
[INFO] skip non existing resourceDirectory /usr/share/jitsi-meet/jitsi-meet-torture/src/main/resources
[INFO]
[INFO] --- maven-compiler-plugin:3.7.0:compile (default-compile) @ jitsi-meet-torture ---
[INFO] No sources to compile
[INFO]
[INFO] --- maven-resources-plugin:2.6:testResources (default-testResources) @ jitsi-meet-torture ---
[INFO] Using 'UTF-8' encoding to copy filtered resources.
[INFO] Copying 0 resource
[INFO] Copying 2 resources
[INFO]
[INFO] --- maven-compiler-plugin:3.7.0:testCompile (default-testCompile) @ jitsi-meet-torture ---
[INFO] Nothing to compile - all classes are up to date
[INFO]
[INFO] --- maven-surefire-plugin:2.22.2:test (default-test) @ jitsi-meet-torture ---
[INFO]
[INFO] -------------------------------------------------------
[INFO]  T E S T S
[INFO] -------------------------------------------------------
[INFO] Running TestSuite
[14] testsToRun=[MalleusJitsificus]
[14] testsToExclude=[]
[14] testsToInclude=[]
[14] ---=== Testing MalleusJitsificus ===---
will run with:
conferences=2
participants=2
senders=1
audio senders=2
duration=120000ms
join delay=0ms
room_name_prefix=hammertesting
enable_p2p=true
max_disrupted_bridges_pct=0.0
regions=null
stage view=false
extra sender params=
extra receiver params=
[16] Start testMain.
[15] Start testMain.
[17] No participant type specified for prefix: web.participant1, will use Chrome...
[18] No participant type specified for prefix: web.participant2, will use Chrome...
[19] No participant type specified for prefix: web.participant1, will use Chrome...
[23] No participant type specified for prefix: web.participant2, will use Chrome...
[pool-2-thread-3] INFO io.github.bonigarcia.wdm.WebDriverManager - Exporting webdriver.chrome.driver as /home/jitsi/.cache/selenium/chromedriver/linux64/102.0.5005.61-1/chromedriver
[pool-1-thread-1] INFO io.github.bonigarcia.wdm.WebDriverManager - Exporting webdriver.chrome.driver as /home/jitsi/.cache/selenium/chromedriver/linux64/102.0.5005.61-1/chromedriver
[pool-2-thread-1] INFO io.github.bonigarcia.wdm.WebDriverManager - Exporting webdriver.chrome.driver as /home/jitsi/.cache/selenium/chromedriver/linux64/102.0.5005.61-1/chromedriver
[pool-1-thread-2] INFO io.github.bonigarcia.wdm.WebDriverManager - Exporting webdriver.chrome.driver as /home/jitsi/.cache/selenium/chromedriver/linux64/102.0.5005.61-1/chromedriver
[15] TestFailure:
java.lang.Exception: Failed with multiple errors. Throws the primary.
        at org.jitsi.meet.test.MalleusJitsificus.testMain(MalleusJitsificus.java:352)
        at java.base/jdk.internal.reflect.NativeMethodAccessorImpl.invoke0(Native Method)
        at java.base/jdk.internal.reflect.NativeMethodAccessorImpl.invoke(NativeMethodAccessorImpl.java:62)
        at java.base/jdk.internal.reflect.DelegatingMethodAccessorImpl.invoke(DelegatingMethodAccessorImpl.java:43)
        at java.base/java.lang.reflect.Method.invoke(Method.java:566)
        at org.testng.internal.MethodInvocationHelper.invokeMethod(MethodInvocationHelper.java:124)
        at org.testng.internal.Invoker.invokeMethod(Invoker.java:571)
        at org.testng.internal.Invoker.invokeTestMethod(Invoker.java:707)
        at org.testng.internal.TestMethodWithDataProviderMethodWorker.call(TestMethodWithDataProviderMethodWorker.java:71)
        at org.testng.internal.TestMethodWithDataProviderMethodWorker.call(TestMethodWithDataProviderMethodWorker.java:14)
        at java.base/java.util.concurrent.FutureTask.run(FutureTask.java:264)
        at java.base/java.util.concurrent.Executors$RunnableAdapter.call(Executors.java:515)
        at java.base/java.util.concurrent.FutureTask.run(FutureTask.java:264)
        at java.base/java.util.concurrent.ThreadPoolExecutor.runWorker(ThreadPoolExecutor.java:1128)
        at java.base/java.util.concurrent.ThreadPoolExecutor$Worker.run(ThreadPoolExecutor.java:628)
        at java.base/java.lang.Thread.run(Thread.java:829)
Caused by: org.openqa.selenium.SessionNotCreatedException: Could not start a new session. Could not start a new session. Error while creating session with the driver service. Stopping driver service: Could not start a new session. Response code 500. Message: unknown error: Chrome failed to start: exited abnormally.
  (unknown error: DevToolsActivePort file doesn't exist)
  (The process started from chrome location /usr/bin/google-chrome is no longer running, so ChromeDriver is assuming that Chrome has crashed.)
Build info: version: '4.1.4', revision: '535d840ee2'
System info: host: 'jitsi-sgn-01', ip: 'xxx.xxx.98.162', os.name: 'Linux', os.arch: 'amd64', os.version: '5.4.0-113-generic', java.version: '11.0.15'
Driver info: driver.version: unknown
Build info: version: '4.1.4', revision: '535d840ee2'
System info: host: 'jitsi-sgn-01', ip: 'xxx.xxx.98.162', os.name: 'Linux', os.arch: 'amd64', os.version: '5.4.0-113-generic', java.version: '11.0.15'
Driver info: driver.version: unknown
Build info: version: '4.1.4', revision: '535d840ee2'
System info: host: 'jitsi-sgh', ip: 'xxx.xxx.98.164', os.name: 'Linux', os.arch: 'amd64', os.version: '5.4.0-104-generic', java.version: '11.0.15'
Driver info: driver.version: unknown
Build info: version: '3.141.59', revision: 'e82be7d358', time: '2018-11-14T08:17:03'
System info: host: 'jitsi-loadtest', ip: 'xxx.xxx.98.166', os.name: 'Linux', os.arch: 'amd64', os.version: '5.4.0-113-generic', java.version: '11.0.15'
Driver info: driver.version: RemoteWebDriver
remote stacktrace: [{fileName=RemoteNode.java, moduleVersion=null, moduleName=null, nativeMethod=false, methodName=newSession, className=org.openqa.selenium.grid.node.remote.RemoteNode, lineNumber=150, classLoaderName=app}, {fileName=LocalDistributor.java, moduleVersion=null, moduleName=null, nativeMethod=false, methodName=startSession, className=org.openqa.selenium.grid.distributor.local.LocalDistributor, lineNumber=609, classLoaderName=app}, {fileName=LocalDistributor.java, moduleVersion=null, moduleName=null, nativeMethod=false, methodName=newSession, className=org.openqa.selenium.grid.distributor.local.LocalDistributor, lineNumber=535, classLoaderName=app}, {fileName=LocalDistributor.java, moduleVersion=null, moduleName=null, nativeMethod=false, methodName=handleNewSessionRequest, className=org.openqa.selenium.grid.distributor.local.LocalDistributor$NewSessionRunnable, lineNumber=746, classLoaderName=app}, {fileName=LocalDistributor.java, moduleVersion=null, moduleName=null, nativeMethod=false, methodName=lambda$run$1, className=org.openqa.selenium.grid.distributor.local.LocalDistributor$NewSessionRunnable, lineNumber=707, classLoaderName=app}, {fileName=ThreadPoolExecutor.java, moduleVersion=11.0.15, moduleName=java.base, nativeMethod=false, methodName=runWorker, className=java.util.concurrent.ThreadPoolExecutor, lineNumber=1128, classLoaderName=null}, {fileName=ThreadPoolExecutor.java, moduleVersion=11.0.15, moduleName=java.base, nativeMethod=false, methodName=run, className=java.util.concurrent.ThreadPoolExecutor$Worker, lineNumber=628, classLoaderName=null}, {fileName=Thread.java, moduleVersion=11.0.15, moduleName=java.base, nativeMethod=false, methodName=run, className=java.lang.Thread, lineNumber=829, classLoaderName=null}]
        at java.base/jdk.internal.reflect.NativeConstructorAccessorImpl.newInstance0(Native Method)
        at java.base/jdk.internal.reflect.NativeConstructorAccessorImpl.newInstance(NativeConstructorAccessorImpl.java:62)
        at java.base/jdk.internal.reflect.DelegatingConstructorAccessorImpl.newInstance(DelegatingConstructorAccessorImpl.java:45)
        at java.base/java.lang.reflect.Constructor.newInstance(Constructor.java:490)
        at org.openqa.selenium.remote.W3CHandshakeResponse.lambda$errorHandler$0(W3CHandshakeResponse.java:62)
        at org.openqa.selenium.remote.HandshakeResponse.lambda$getResponseFunction$0(HandshakeResponse.java:30)
        at org.openqa.selenium.remote.ProtocolHandshake.lambda$createSession$0(ProtocolHandshake.java:126)
        at java.base/java.util.stream.ReferencePipeline$3$1.accept(ReferencePipeline.java:195)
        at java.base/java.util.Spliterators$ArraySpliterator.tryAdvance(Spliterators.java:958)
        at java.base/java.util.stream.ReferencePipeline.forEachWithCancel(ReferencePipeline.java:127)
        at java.base/java.util.stream.AbstractPipeline.copyIntoWithCancel(AbstractPipeline.java:502)
        at java.base/java.util.stream.AbstractPipeline.copyInto(AbstractPipeline.java:488)
        at java.base/java.util.stream.AbstractPipeline.wrapAndCopyInto(AbstractPipeline.java:474)
        at java.base/java.util.stream.FindOps$FindOp.evaluateSequential(FindOps.java:150)
        at java.base/java.util.stream.AbstractPipeline.evaluate(AbstractPipeline.java:234)
        at java.base/java.util.stream.ReferencePipeline.findFirst(ReferencePipeline.java:543)
        at org.openqa.selenium.remote.ProtocolHandshake.createSession(ProtocolHandshake.java:128)
        at org.openqa.selenium.remote.ProtocolHandshake.createSession(ProtocolHandshake.java:74)
        at org.openqa.selenium.remote.HttpCommandExecutor.execute(HttpCommandExecutor.java:136)
        at org.openqa.selenium.remote.RemoteWebDriver.execute(RemoteWebDriver.java:552)
        at org.openqa.selenium.remote.RemoteWebDriver.startSession(RemoteWebDriver.java:213)
        at org.openqa.selenium.remote.RemoteWebDriver.<init>(RemoteWebDriver.java:131)
        at org.openqa.selenium.remote.RemoteWebDriver.<init>(RemoteWebDriver.java:144)
        at org.jitsi.meet.test.web.WebParticipantFactory.startWebDriver(WebParticipantFactory.java:318)
        at org.jitsi.meet.test.web.WebParticipantFactory.doCreateParticipant(WebParticipantFactory.java:100)
        at org.jitsi.meet.test.web.WebParticipantFactory.doCreateParticipant(WebParticipantFactory.java:38)
        at org.jitsi.meet.test.base.ParticipantFactory.createParticipant(ParticipantFactory.java:35)
        at org.jitsi.meet.test.base.ParticipantHelper.createParticipant(ParticipantHelper.java:162)
        at org.jitsi.meet.test.base.ParticipantHelper.createParticipant(ParticipantHelper.java:113)
        at org.jitsi.meet.test.MalleusJitsificus$MalleusTask.join(MalleusJitsificus.java:452)
        at java.base/java.util.concurrent.Executors$RunnableAdapter.call(Executors.java:515)
        at java.base/java.util.concurrent.FutureTask.run(FutureTask.java:264)
        at java.base/java.util.concurrent.ScheduledThreadPoolExecutor$ScheduledFutureTask.run(ScheduledThreadPoolExecutor.java:304)
        ... 3 more
[16] TestFailure:
java.lang.Exception: Failed with multiple errors. Throws the primary.
        at org.jitsi.meet.test.MalleusJitsificus.testMain(MalleusJitsificus.java:352)
        at java.base/jdk.internal.reflect.NativeMethodAccessorImpl.invoke0(Native Method)
        at java.base/jdk.internal.reflect.NativeMethodAccessorImpl.invoke(NativeMethodAccessorImpl.java:62)
        at java.base/jdk.internal.reflect.DelegatingMethodAccessorImpl.invoke(DelegatingMethodAccessorImpl.java:43)
        at java.base/java.lang.reflect.Method.invoke(Method.java:566)
        at org.testng.internal.MethodInvocationHelper.invokeMethod(MethodInvocationHelper.java:124)
        at org.testng.internal.Invoker.invokeMethod(Invoker.java:571)
        at org.testng.internal.Invoker.invokeTestMethod(Invoker.java:707)
        at org.testng.internal.TestMethodWithDataProviderMethodWorker.call(TestMethodWithDataProviderMethodWorker.java:71)
        at org.testng.internal.TestMethodWithDataProviderMethodWorker.call(TestMethodWithDataProviderMethodWorker.java:14)
        at java.base/java.util.concurrent.FutureTask.run(FutureTask.java:264)
        at java.base/java.util.concurrent.Executors$RunnableAdapter.call(Executors.java:515)
        at java.base/java.util.concurrent.FutureTask.run(FutureTask.java:264)
        at java.base/java.util.concurrent.ThreadPoolExecutor.runWorker(ThreadPoolExecutor.java:1128)
        at java.base/java.util.concurrent.ThreadPoolExecutor$Worker.run(ThreadPoolExecutor.java:628)
        at java.base/java.lang.Thread.run(Thread.java:829)
Caused by: org.openqa.selenium.SessionNotCreatedException: Could not start a new session. Could not start a new session. Error while creating session with the driver service. Stopping driver service: Could not start a new session. Response code 500. Message: unknown error: Chrome failed to start: exited abnormally.
  (unknown error: DevToolsActivePort file doesn't exist)
  (The process started from chrome location /usr/bin/google-chrome is no longer running, so ChromeDriver is assuming that Chrome has crashed.)
Build info: version: '4.1.4', revision: '535d840ee2'
System info: host: 'jitsi-sgn-01', ip: 'xxx.xxx.98.162', os.name: 'Linux', os.arch: 'amd64', os.version: '5.4.0-113-generic', java.version: '11.0.15'
Driver info: driver.version: unknown
Build info: version: '4.1.4', revision: '535d840ee2'
System info: host: 'jitsi-sgn-01', ip: 'xxx.xxx.98.162', os.name: 'Linux', os.arch: 'amd64', os.version: '5.4.0-113-generic', java.version: '11.0.15'
Driver info: driver.version: unknown
Build info: version: '4.1.4', revision: '535d840ee2'
System info: host: 'jitsi-sgh', ip: 'xxx.xxx.98.164', os.name: 'Linux', os.arch: 'amd64', os.version: '5.4.0-104-generic', java.version: '11.0.15'
Driver info: driver.version: unknown
Build info: version: '3.141.59', revision: 'e82be7d358', time: '2018-11-14T08:17:03'
System info: host: 'jitsi-loadtest', ip: 'xxx.xxx.98.166', os.name: 'Linux', os.arch: 'amd64', os.version: '5.4.0-113-generic', java.version: '11.0.15'
Driver info: driver.version: RemoteWebDriver
remote stacktrace: [{fileName=RemoteNode.java, moduleVersion=null, moduleName=null, nativeMethod=false, methodName=newSession, className=org.openqa.selenium.grid.node.remote.RemoteNode, lineNumber=150, classLoaderName=app}, {fileName=LocalDistributor.java, moduleVersion=null, moduleName=null, nativeMethod=false, methodName=startSession, className=org.openqa.selenium.grid.distributor.local.LocalDistributor, lineNumber=609, classLoaderName=app}, {fileName=LocalDistributor.java, moduleVersion=null, moduleName=null, nativeMethod=false, methodName=newSession, className=org.openqa.selenium.grid.distributor.local.LocalDistributor, lineNumber=535, classLoaderName=app}, {fileName=LocalDistributor.java, moduleVersion=null, moduleName=null, nativeMethod=false, methodName=handleNewSessionRequest, className=org.openqa.selenium.grid.distributor.local.LocalDistributor$NewSessionRunnable, lineNumber=746, classLoaderName=app}, {fileName=LocalDistributor.java, moduleVersion=null, moduleName=null, nativeMethod=false, methodName=lambda$run$1, className=org.openqa.selenium.grid.distributor.local.LocalDistributor$NewSessionRunnable, lineNumber=707, classLoaderName=app}, {fileName=ThreadPoolExecutor.java, moduleVersion=11.0.15, moduleName=java.base, nativeMethod=false, methodName=runWorker, className=java.util.concurrent.ThreadPoolExecutor, lineNumber=1128, classLoaderName=null}, {fileName=ThreadPoolExecutor.java, moduleVersion=11.0.15, moduleName=java.base, nativeMethod=false, methodName=run, className=java.util.concurrent.ThreadPoolExecutor$Worker, lineNumber=628, classLoaderName=null}, {fileName=Thread.java, moduleVersion=11.0.15, moduleName=java.base, nativeMethod=false, methodName=run, className=java.lang.Thread, lineNumber=829, classLoaderName=null}]
        at java.base/jdk.internal.reflect.NativeConstructorAccessorImpl.newInstance0(Native Method)
        at java.base/jdk.internal.reflect.NativeConstructorAccessorImpl.newInstance(NativeConstructorAccessorImpl.java:62)
        at java.base/jdk.internal.reflect.DelegatingConstructorAccessorImpl.newInstance(DelegatingConstructorAccessorImpl.java:45)
        at java.base/java.lang.reflect.Constructor.newInstance(Constructor.java:490)
        at org.openqa.selenium.remote.W3CHandshakeResponse.lambda$errorHandler$0(W3CHandshakeResponse.java:62)
        at org.openqa.selenium.remote.HandshakeResponse.lambda$getResponseFunction$0(HandshakeResponse.java:30)
        at org.openqa.selenium.remote.ProtocolHandshake.lambda$createSession$0(ProtocolHandshake.java:126)
        at java.base/java.util.stream.ReferencePipeline$3$1.accept(ReferencePipeline.java:195)
        at java.base/java.util.Spliterators$ArraySpliterator.tryAdvance(Spliterators.java:958)
        at java.base/java.util.stream.ReferencePipeline.forEachWithCancel(ReferencePipeline.java:127)
        at java.base/java.util.stream.AbstractPipeline.copyIntoWithCancel(AbstractPipeline.java:502)
        at java.base/java.util.stream.AbstractPipeline.copyInto(AbstractPipeline.java:488)
        at java.base/java.util.stream.AbstractPipeline.wrapAndCopyInto(AbstractPipeline.java:474)
        at java.base/java.util.stream.FindOps$FindOp.evaluateSequential(FindOps.java:150)
        at java.base/java.util.stream.AbstractPipeline.evaluate(AbstractPipeline.java:234)
        at java.base/java.util.stream.ReferencePipeline.findFirst(ReferencePipeline.java:543)
        at org.openqa.selenium.remote.ProtocolHandshake.createSession(ProtocolHandshake.java:128)
        at org.openqa.selenium.remote.ProtocolHandshake.createSession(ProtocolHandshake.java:74)
        at org.openqa.selenium.remote.HttpCommandExecutor.execute(HttpCommandExecutor.java:136)
        at org.openqa.selenium.remote.RemoteWebDriver.execute(RemoteWebDriver.java:552)
        at org.openqa.selenium.remote.RemoteWebDriver.startSession(RemoteWebDriver.java:213)
        at org.openqa.selenium.remote.RemoteWebDriver.<init>(RemoteWebDriver.java:131)
        at org.openqa.selenium.remote.RemoteWebDriver.<init>(RemoteWebDriver.java:144)
        at org.jitsi.meet.test.web.WebParticipantFactory.startWebDriver(WebParticipantFactory.java:318)
        at org.jitsi.meet.test.web.WebParticipantFactory.doCreateParticipant(WebParticipantFactory.java:100)
        at org.jitsi.meet.test.web.WebParticipantFactory.doCreateParticipant(WebParticipantFactory.java:38)
        at org.jitsi.meet.test.base.ParticipantFactory.createParticipant(ParticipantFactory.java:35)
        at org.jitsi.meet.test.base.ParticipantHelper.createParticipant(ParticipantHelper.java:162)
        at org.jitsi.meet.test.base.ParticipantHelper.createParticipant(ParticipantHelper.java:113)
        at org.jitsi.meet.test.MalleusJitsificus$MalleusTask.join(MalleusJitsificus.java:452)
        at java.base/java.util.concurrent.Executors$RunnableAdapter.call(Executors.java:515)
        at java.base/java.util.concurrent.FutureTask.run(FutureTask.java:264)
        at java.base/java.util.concurrent.ScheduledThreadPoolExecutor$ScheduledFutureTask.run(ScheduledThreadPoolExecutor.java:304)
        ... 3 more
[16] End testMain.
[15] End testMain.
[ERROR] Tests run: 452, Failures: 2, Errors: 0, Skipped: 450, Time elapsed: 2.804 s <<< FAILURE! - in TestSuite
[ERROR] testMain(org.jitsi.meet.test.MalleusJitsificus)  Time elapsed: 1.844 s  <<< FAILURE!
java.lang.Exception: Failed with multiple errors. Throws the primary.
        at org.jitsi.meet.test.MalleusJitsificus.testMain(MalleusJitsificus.java:352)
Caused by: org.openqa.selenium.SessionNotCreatedException:
Could not start a new session. Could not start a new session. Error while creating session with the driver service. Stopping driver service: Could not start a new session. Response code 500. Message: unknown error: Chrome failed to start: exited abnormally.
  (unknown error: DevToolsActivePort file doesn't exist)
  (The process started from chrome location /usr/bin/google-chrome is no longer running, so ChromeDriver is assuming that Chrome has crashed.)
Build info: version: '4.1.4', revision: '535d840ee2'
System info: host: 'jitsi-sgn-01', ip: 'xxx.xxx.98.162', os.name: 'Linux', os.arch: 'amd64', os.version: '5.4.0-113-generic', java.version: '11.0.15'
Driver info: driver.version: unknown
Build info: version: '4.1.4', revision: '535d840ee2'
System info: host: 'jitsi-sgn-01', ip: 'xxx.xxx.98.162', os.name: 'Linux', os.arch: 'amd64', os.version: '5.4.0-113-generic', java.version: '11.0.15'
Driver info: driver.version: unknown
Build info: version: '4.1.4', revision: '535d840ee2'
System info: host: 'jitsi-sgh', ip: 'xxx.xxx.98.164', os.name: 'Linux', os.arch: 'amd64', os.version: '5.4.0-104-generic', java.version: '11.0.15'
Driver info: driver.version: unknown
Build info: version: '3.141.59', revision: 'e82be7d358', time: '2018-11-14T08:17:03'
System info: host: 'jitsi-loadtest', ip: 'xxx.xxx.98.166', os.name: 'Linux', os.arch: 'amd64', os.version: '5.4.0-113-generic', java.version: '11.0.15'
Driver info: driver.version: RemoteWebDriver
remote stacktrace: [{fileName=RemoteNode.java, moduleVersion=null, moduleName=null, nativeMethod=false, methodName=newSession, className=org.openqa.selenium.grid.node.remote.RemoteNode, lineNumber=150, classLoaderName=app}, {fileName=LocalDistributor.java, moduleVersion=null, moduleName=null, nativeMethod=false, methodName=startSession, className=org.openqa.selenium.grid.distributor.local.LocalDistributor, lineNumber=609, classLoaderName=app}, {fileName=LocalDistributor.java, moduleVersion=null, moduleName=null, nativeMethod=false, methodName=newSession, className=org.openqa.selenium.grid.distributor.local.LocalDistributor, lineNumber=535, classLoaderName=app}, {fileName=LocalDistributor.java, moduleVersion=null, moduleName=null, nativeMethod=false, methodName=handleNewSessionRequest, className=org.openqa.selenium.grid.distributor.local.LocalDistributor$NewSessionRunnable, lineNumber=746, classLoaderName=app}, {fileName=LocalDistributor.java, moduleVersion=null, moduleName=null, nativeMethod=false, methodName=lambda$run$1, className=org.openqa.selenium.grid.distributor.local.LocalDistributor$NewSessionRunnable, lineNumber=707, classLoaderName=app}, {fileName=ThreadPoolExecutor.java, moduleVersion=11.0.15, moduleName=java.base, nativeMethod=false, methodName=runWorker, className=java.util.concurrent.ThreadPoolExecutor, lineNumber=1128, classLoaderName=null}, {fileName=ThreadPoolExecutor.java, moduleVersion=11.0.15, moduleName=java.base, nativeMethod=false, methodName=run, className=java.util.concurrent.ThreadPoolExecutor$Worker, lineNumber=628, classLoaderName=null}, {fileName=Thread.java, moduleVersion=11.0.15, moduleName=java.base, nativeMethod=false, methodName=run, className=java.lang.Thread, lineNumber=829, classLoaderName=null}]
[ERROR] testMain(org.jitsi.meet.test.MalleusJitsificus)  Time elapsed: 1.848 s  <<< FAILURE!
java.lang.Exception: Failed with multiple errors. Throws the primary.
        at org.jitsi.meet.test.MalleusJitsificus.testMain(MalleusJitsificus.java:352)
Caused by: org.openqa.selenium.SessionNotCreatedException:
Could not start a new session. Could not start a new session. Error while creating session with the driver service. Stopping driver service: Could not start a new session. Response code 500. Message: unknown error: Chrome failed to start: exited abnormally.
  (unknown error: DevToolsActivePort file doesn't exist)
  (The process started from chrome location /usr/bin/google-chrome is no longer running, so ChromeDriver is assuming that Chrome has crashed.)
Build info: version: '4.1.4', revision: '535d840ee2'
System info: host: 'jitsi-sgn-01', ip: 'xxx.xxx.98.162', os.name: 'Linux', os.arch: 'amd64', os.version: '5.4.0-113-generic', java.version: '11.0.15'
Driver info: driver.version: unknown
Build info: version: '4.1.4', revision: '535d840ee2'
System info: host: 'jitsi-sgn-01', ip: 'xxx.xxx.98.162', os.name: 'Linux', os.arch: 'amd64', os.version: '5.4.0-113-generic', java.version: '11.0.15'
Driver info: driver.version: unknown
Build info: version: '4.1.4', revision: '535d840ee2'
System info: host: 'jitsi-sgh', ip: 'xxx.xxx.98.164', os.name: 'Linux', os.arch: 'amd64', os.version: '5.4.0-104-generic', java.version: '11.0.15'
Driver info: driver.version: unknown
Build info: version: '3.141.59', revision: 'e82be7d358', time: '2018-11-14T08:17:03'
System info: host: 'jitsi-loadtest', ip: 'xxx.xxx.98.166', os.name: 'Linux', os.arch: 'amd64', os.version: '5.4.0-113-generic', java.version: '11.0.15'
Driver info: driver.version: RemoteWebDriver
remote stacktrace: [{fileName=RemoteNode.java, moduleVersion=null, moduleName=null, nativeMethod=false, methodName=newSession, className=org.openqa.selenium.grid.node.remote.RemoteNode, lineNumber=150, classLoaderName=app}, {fileName=LocalDistributor.java, moduleVersion=null, moduleName=null, nativeMethod=false, methodName=startSession, className=org.openqa.selenium.grid.distributor.local.LocalDistributor, lineNumber=609, classLoaderName=app}, {fileName=LocalDistributor.java, moduleVersion=null, moduleName=null, nativeMethod=false, methodName=newSession, className=org.openqa.selenium.grid.distributor.local.LocalDistributor, lineNumber=535, classLoaderName=app}, {fileName=LocalDistributor.java, moduleVersion=null, moduleName=null, nativeMethod=false, methodName=handleNewSessionRequest, className=org.openqa.selenium.grid.distributor.local.LocalDistributor$NewSessionRunnable, lineNumber=746, classLoaderName=app}, {fileName=LocalDistributor.java, moduleVersion=null, moduleName=null, nativeMethod=false, methodName=lambda$run$1, className=org.openqa.selenium.grid.distributor.local.LocalDistributor$NewSessionRunnable, lineNumber=707, classLoaderName=app}, {fileName=ThreadPoolExecutor.java, moduleVersion=11.0.15, moduleName=java.base, nativeMethod=false, methodName=runWorker, className=java.util.concurrent.ThreadPoolExecutor, lineNumber=1128, classLoaderName=null}, {fileName=ThreadPoolExecutor.java, moduleVersion=11.0.15, moduleName=java.base, nativeMethod=false, methodName=run, className=java.util.concurrent.ThreadPoolExecutor$Worker, lineNumber=628, classLoaderName=null}, {fileName=Thread.java, moduleVersion=11.0.15, moduleName=java.base, nativeMethod=false, methodName=run, className=java.lang.Thread, lineNumber=829, classLoaderName=null}]
[INFO]
[INFO] Results:
[INFO]
[ERROR] Failures:
[ERROR] org.jitsi.meet.test.MalleusJitsificus.testMain(org.jitsi.meet.test.MalleusJitsificus)
[ERROR]   Run 1: MalleusJitsificus.testMain:352  Failed with multiple errors. Throws the primar...
[ERROR]   Run 2: MalleusJitsificus.testMain:352  Failed with multiple errors. Throws the primar...
[INFO]
[INFO]
[ERROR] Tests run: 447, Failures: 1, Errors: 0, Skipped: 446
[INFO]
[INFO] ------------------------------------------------------------------------
[INFO] BUILD FAILURE
[INFO] ------------------------------------------------------------------------
[INFO] Total time:  4.545 s
[INFO] Finished at: 2022-06-08T08:37:33+02:00
[INFO] ------------------------------------------------------------------------
[ERROR] Failed to execute goal org.apache.maven.plugins:maven-surefire-plugin:2.22.2:test (default-test) on project jitsi-meet-torture: There are test failures.
[ERROR]
[ERROR] Please refer to /usr/share/jitsi-meet/jitsi-meet-torture/target/surefire-reports for the individual test results.
[ERROR] Please refer to dump files (if any exist) [date].dump, [date]-jvmRun[N].dump and [date].dumpstream.
[ERROR] -> [Help 1]
[ERROR]
[ERROR] To see the full stack trace of the errors, re-run Maven with the -e switch.
[ERROR] Re-run Maven using the -X switch to enable full debug logging.
[ERROR]
[ERROR] For more information about the errors and possible solutions, please read the following articles:
[ERROR] [Help 1] http://cwiki.apache.org/confluence/display/MAVEN/MojoFailureException
[INFO]
[INFO] --------------------< org.jitsi:jitsi-meet-torture >--------------------
[INFO] Building jitsi-meet-torture 1.0-SNAPSHOT
[INFO] --------------------------------[ jar ]---------------------------------
[INFO]
[INFO] --- maven-resources-plugin:2.6:resources (default-resources) @ jitsi-meet-torture ---
[INFO] Using 'UTF-8' encoding to copy filtered resources.
[INFO] skip non existing resourceDirectory /usr/share/jitsi-meet/jitsi-meet-torture/src/main/resources
[INFO]
[INFO] --- maven-compiler-plugin:3.7.0:compile (default-compile) @ jitsi-meet-torture ---
[INFO] No sources to compile
[INFO]
[INFO] --- maven-resources-plugin:2.6:testResources (default-testResources) @ jitsi-meet-torture ---
[INFO] Using 'UTF-8' encoding to copy filtered resources.
[INFO] Copying 0 resource
[INFO] Copying 2 resources
[INFO]
[INFO] --- maven-compiler-plugin:3.7.0:testCompile (default-testCompile) @ jitsi-meet-torture ---
[INFO] Nothing to compile - all classes are up to date
[INFO]
[INFO] --- maven-surefire-plugin:2.22.2:test (default-test) @ jitsi-meet-torture ---
[INFO]
[INFO] -------------------------------------------------------
[INFO]  T E S T S
[INFO] -------------------------------------------------------
[INFO] Running TestSuite
[14] testsToRun=[MalleusJitsificus]
[14] testsToExclude=[]
[14] testsToInclude=[]
[14] ---=== Testing MalleusJitsificus ===---
will run with:
conferences=2
participants=2
senders=1
audio senders=2
duration=120000ms
join delay=0ms
room_name_prefix=hammertesting
enable_p2p=true
max_disrupted_bridges_pct=0.0
regions=null
stage view=false
extra sender params=
extra receiver params=
[16] Start testMain.
[15] Start testMain.
[17] No participant type specified for prefix: web.participant1, will use Chrome...
[18] No participant type specified for prefix: web.participant2, will use Chrome...
[19] No participant type specified for prefix: web.participant1, will use Chrome...
[23] No participant type specified for prefix: web.participant2, will use Chrome...
[pool-2-thread-3] INFO io.github.bonigarcia.wdm.WebDriverManager - Exporting webdriver.chrome.driver as /home/jitsi/.cache/selenium/chromedriver/linux64/102.0.5005.61-1/chromedriver
[pool-1-thread-1] INFO io.github.bonigarcia.wdm.WebDriverManager - Exporting webdriver.chrome.driver as /home/jitsi/.cache/selenium/chromedriver/linux64/102.0.5005.61-1/chromedriver
[pool-2-thread-1] INFO io.github.bonigarcia.wdm.WebDriverManager - Exporting webdriver.chrome.driver as /home/jitsi/.cache/selenium/chromedriver/linux64/102.0.5005.61-1/chromedriver
[pool-1-thread-2] INFO io.github.bonigarcia.wdm.WebDriverManager - Exporting webdriver.chrome.driver as /home/jitsi/.cache/selenium/chromedriver/linux64/102.0.5005.61-1/chromedriver
[15] TestFailure:
java.lang.Exception: Failed with multiple errors. Throws the primary.
        at org.jitsi.meet.test.MalleusJitsificus.testMain(MalleusJitsificus.java:352)
        at java.base/jdk.internal.reflect.NativeMethodAccessorImpl.invoke0(Native Method)
        at java.base/jdk.internal.reflect.NativeMethodAccessorImpl.invoke(NativeMethodAccessorImpl.java:62)
        at java.base/jdk.internal.reflect.DelegatingMethodAccessorImpl.invoke(DelegatingMethodAccessorImpl.java:43)
        at java.base/java.lang.reflect.Method.invoke(Method.java:566)
        at org.testng.internal.MethodInvocationHelper.invokeMethod(MethodInvocationHelper.java:124)
        at org.testng.internal.Invoker.invokeMethod(Invoker.java:571)
        at org.testng.internal.Invoker.invokeTestMethod(Invoker.java:707)
        at org.testng.internal.TestMethodWithDataProviderMethodWorker.call(TestMethodWithDataProviderMethodWorker.java:71)
        at org.testng.internal.TestMethodWithDataProviderMethodWorker.call(TestMethodWithDataProviderMethodWorker.java:14)
        at java.base/java.util.concurrent.FutureTask.run(FutureTask.java:264)
        at java.base/java.util.concurrent.Executors$RunnableAdapter.call(Executors.java:515)
        at java.base/java.util.concurrent.FutureTask.run(FutureTask.java:264)
        at java.base/java.util.concurrent.ThreadPoolExecutor.runWorker(ThreadPoolExecutor.java:1128)
        at java.base/java.util.concurrent.ThreadPoolExecutor$Worker.run(ThreadPoolExecutor.java:628)
        at java.base/java.lang.Thread.run(Thread.java:829)
Caused by: org.openqa.selenium.SessionNotCreatedException: Could not start a new session. Could not start a new session. Error while creating session with the driver service. Stopping driver service: Could not start a new session. Response code 500. Message: unknown error: Chrome failed to start: exited abnormally.
  (unknown error: DevToolsActivePort file doesn't exist)
  (The process started from chrome location /usr/bin/google-chrome is no longer running, so ChromeDriver is assuming that Chrome has crashed.)
Build info: version: '4.1.4', revision: '535d840ee2'
System info: host: 'jitsi-sgn-01', ip: 'xxx.xxx.98.162', os.name: 'Linux', os.arch: 'amd64', os.version: '5.4.0-113-generic', java.version: '11.0.15'
Driver info: driver.version: unknown
Build info: version: '4.1.4', revision: '535d840ee2'
System info: host: 'jitsi-sgn-01', ip: 'xxx.xxx.98.162', os.name: 'Linux', os.arch: 'amd64', os.version: '5.4.0-113-generic', java.version: '11.0.15'
Driver info: driver.version: unknown
Build info: version: '4.1.4', revision: '535d840ee2'
System info: host: 'jitsi-sgh', ip: 'xxx.xxx.98.164', os.name: 'Linux', os.arch: 'amd64', os.version: '5.4.0-104-generic', java.version: '11.0.15'
Driver info: driver.version: unknown
Build info: version: '3.141.59', revision: 'e82be7d358', time: '2018-11-14T08:17:03'
System info: host: 'jitsi-loadtest', ip: 'xxx.xxx.98.166', os.name: 'Linux', os.arch: 'amd64', os.version: '5.4.0-113-generic', java.version: '11.0.15'
Driver info: driver.version: RemoteWebDriver
remote stacktrace: [{fileName=RemoteNode.java, moduleVersion=null, moduleName=null, nativeMethod=false, methodName=newSession, className=org.openqa.selenium.grid.node.remote.RemoteNode, lineNumber=150, classLoaderName=app}, {fileName=LocalDistributor.java, moduleVersion=null, moduleName=null, nativeMethod=false, methodName=startSession, className=org.openqa.selenium.grid.distributor.local.LocalDistributor, lineNumber=609, classLoaderName=app}, {fileName=LocalDistributor.java, moduleVersion=null, moduleName=null, nativeMethod=false, methodName=newSession, className=org.openqa.selenium.grid.distributor.local.LocalDistributor, lineNumber=535, classLoaderName=app}, {fileName=LocalDistributor.java, moduleVersion=null, moduleName=null, nativeMethod=false, methodName=handleNewSessionRequest, className=org.openqa.selenium.grid.distributor.local.LocalDistributor$NewSessionRunnable, lineNumber=746, classLoaderName=app}, {fileName=LocalDistributor.java, moduleVersion=null, moduleName=null, nativeMethod=false, methodName=lambda$run$1, className=org.openqa.selenium.grid.distributor.local.LocalDistributor$NewSessionRunnable, lineNumber=707, classLoaderName=app}, {fileName=ThreadPoolExecutor.java, moduleVersion=11.0.15, moduleName=java.base, nativeMethod=false, methodName=runWorker, className=java.util.concurrent.ThreadPoolExecutor, lineNumber=1128, classLoaderName=null}, {fileName=ThreadPoolExecutor.java, moduleVersion=11.0.15, moduleName=java.base, nativeMethod=false, methodName=run, className=java.util.concurrent.ThreadPoolExecutor$Worker, lineNumber=628, classLoaderName=null}, {fileName=Thread.java, moduleVersion=11.0.15, moduleName=java.base, nativeMethod=false, methodName=run, className=java.lang.Thread, lineNumber=829, classLoaderName=null}]
        at java.base/jdk.internal.reflect.NativeConstructorAccessorImpl.newInstance0(Native Method)
        at java.base/jdk.internal.reflect.NativeConstructorAccessorImpl.newInstance(NativeConstructorAccessorImpl.java:62)
        at java.base/jdk.internal.reflect.DelegatingConstructorAccessorImpl.newInstance(DelegatingConstructorAccessorImpl.java:45)
        at java.base/java.lang.reflect.Constructor.newInstance(Constructor.java:490)
        at org.openqa.selenium.remote.W3CHandshakeResponse.lambda$errorHandler$0(W3CHandshakeResponse.java:62)
        at org.openqa.selenium.remote.HandshakeResponse.lambda$getResponseFunction$0(HandshakeResponse.java:30)
        at org.openqa.selenium.remote.ProtocolHandshake.lambda$createSession$0(ProtocolHandshake.java:126)
        at java.base/java.util.stream.ReferencePipeline$3$1.accept(ReferencePipeline.java:195)
        at java.base/java.util.Spliterators$ArraySpliterator.tryAdvance(Spliterators.java:958)
        at java.base/java.util.stream.ReferencePipeline.forEachWithCancel(ReferencePipeline.java:127)
        at java.base/java.util.stream.AbstractPipeline.copyIntoWithCancel(AbstractPipeline.java:502)
        at java.base/java.util.stream.AbstractPipeline.copyInto(AbstractPipeline.java:488)
        at java.base/java.util.stream.AbstractPipeline.wrapAndCopyInto(AbstractPipeline.java:474)
        at java.base/java.util.stream.FindOps$FindOp.evaluateSequential(FindOps.java:150)
        at java.base/java.util.stream.AbstractPipeline.evaluate(AbstractPipeline.java:234)
        at java.base/java.util.stream.ReferencePipeline.findFirst(ReferencePipeline.java:543)
        at org.openqa.selenium.remote.ProtocolHandshake.createSession(ProtocolHandshake.java:128)
        at org.openqa.selenium.remote.ProtocolHandshake.createSession(ProtocolHandshake.java:74)
        at org.openqa.selenium.remote.HttpCommandExecutor.execute(HttpCommandExecutor.java:136)
        at org.openqa.selenium.remote.RemoteWebDriver.execute(RemoteWebDriver.java:552)
        at org.openqa.selenium.remote.RemoteWebDriver.startSession(RemoteWebDriver.java:213)
        at org.openqa.selenium.remote.RemoteWebDriver.<init>(RemoteWebDriver.java:131)
        at org.openqa.selenium.remote.RemoteWebDriver.<init>(RemoteWebDriver.java:144)
        at org.jitsi.meet.test.web.WebParticipantFactory.startWebDriver(WebParticipantFactory.java:318)
        at org.jitsi.meet.test.web.WebParticipantFactory.doCreateParticipant(WebParticipantFactory.java:100)
        at org.jitsi.meet.test.web.WebParticipantFactory.doCreateParticipant(WebParticipantFactory.java:38)
        at org.jitsi.meet.test.base.ParticipantFactory.createParticipant(ParticipantFactory.java:35)
        at org.jitsi.meet.test.base.ParticipantHelper.createParticipant(ParticipantHelper.java:162)
        at org.jitsi.meet.test.base.ParticipantHelper.createParticipant(ParticipantHelper.java:113)
        at org.jitsi.meet.test.MalleusJitsificus$MalleusTask.join(MalleusJitsificus.java:452)
        at java.base/java.util.concurrent.Executors$RunnableAdapter.call(Executors.java:515)
        at java.base/java.util.concurrent.FutureTask.run(FutureTask.java:264)
        at java.base/java.util.concurrent.ScheduledThreadPoolExecutor$ScheduledFutureTask.run(ScheduledThreadPoolExecutor.java:304)
        ... 3 more
[16] TestFailure:
java.lang.Exception: Failed with multiple errors. Throws the primary.
        at org.jitsi.meet.test.MalleusJitsificus.testMain(MalleusJitsificus.java:352)
        at java.base/jdk.internal.reflect.NativeMethodAccessorImpl.invoke0(Native Method)
        at java.base/jdk.internal.reflect.NativeMethodAccessorImpl.invoke(NativeMethodAccessorImpl.java:62)
        at java.base/jdk.internal.reflect.DelegatingMethodAccessorImpl.invoke(DelegatingMethodAccessorImpl.java:43)
        at java.base/java.lang.reflect.Method.invoke(Method.java:566)
        at org.testng.internal.MethodInvocationHelper.invokeMethod(MethodInvocationHelper.java:124)
        at org.testng.internal.Invoker.invokeMethod(Invoker.java:571)
        at org.testng.internal.Invoker.invokeTestMethod(Invoker.java:707)
        at org.testng.internal.TestMethodWithDataProviderMethodWorker.call(TestMethodWithDataProviderMethodWorker.java:71)
        at org.testng.internal.TestMethodWithDataProviderMethodWorker.call(TestMethodWithDataProviderMethodWorker.java:14)
        at java.base/java.util.concurrent.FutureTask.run(FutureTask.java:264)
        at java.base/java.util.concurrent.Executors$RunnableAdapter.call(Executors.java:515)
        at java.base/java.util.concurrent.FutureTask.run(FutureTask.java:264)
        at java.base/java.util.concurrent.ThreadPoolExecutor.runWorker(ThreadPoolExecutor.java:1128)
        at java.base/java.util.concurrent.ThreadPoolExecutor$Worker.run(ThreadPoolExecutor.java:628)
        at java.base/java.lang.Thread.run(Thread.java:829)
Caused by: org.openqa.selenium.SessionNotCreatedException: Could not start a new session. Could not start a new session. Error while creating session with the driver service. Stopping driver service: Could not start a new session. Response code 500. Message: unknown error: Chrome failed to start: exited abnormally.
  (unknown error: DevToolsActivePort file doesn't exist)
  (The process started from chrome location /usr/bin/google-chrome is no longer running, so ChromeDriver is assuming that Chrome has crashed.)
Build info: version: '4.1.4', revision: '535d840ee2'
System info: host: 'jitsi-sgn-01', ip: 'xxx.xxx.98.162', os.name: 'Linux', os.arch: 'amd64', os.version: '5.4.0-113-generic', java.version: '11.0.15'
Driver info: driver.version: unknown
Build info: version: '4.1.4', revision: '535d840ee2'
System info: host: 'jitsi-sgn-01', ip: 'xxx.xxx.98.162', os.name: 'Linux', os.arch: 'amd64', os.version: '5.4.0-113-generic', java.version: '11.0.15'
Driver info: driver.version: unknown
Build info: version: '4.1.4', revision: '535d840ee2'
System info: host: 'jitsi-sgh', ip: 'xxx.xxx.98.164', os.name: 'Linux', os.arch: 'amd64', os.version: '5.4.0-104-generic', java.version: '11.0.15'
Driver info: driver.version: unknown
Build info: version: '3.141.59', revision: 'e82be7d358', time: '2018-11-14T08:17:03'
System info: host: 'jitsi-loadtest', ip: 'xxx.xxx.98.166', os.name: 'Linux', os.arch: 'amd64', os.version: '5.4.0-113-generic', java.version: '11.0.15'
Driver info: driver.version: RemoteWebDriver
remote stacktrace: [{fileName=RemoteNode.java, moduleVersion=null, moduleName=null, nativeMethod=false, methodName=newSession, className=org.openqa.selenium.grid.node.remote.RemoteNode, lineNumber=150, classLoaderName=app}, {fileName=LocalDistributor.java, moduleVersion=null, moduleName=null, nativeMethod=false, methodName=startSession, className=org.openqa.selenium.grid.distributor.local.LocalDistributor, lineNumber=609, classLoaderName=app}, {fileName=LocalDistributor.java, moduleVersion=null, moduleName=null, nativeMethod=false, methodName=newSession, className=org.openqa.selenium.grid.distributor.local.LocalDistributor, lineNumber=535, classLoaderName=app}, {fileName=LocalDistributor.java, moduleVersion=null, moduleName=null, nativeMethod=false, methodName=handleNewSessionRequest, className=org.openqa.selenium.grid.distributor.local.LocalDistributor$NewSessionRunnable, lineNumber=746, classLoaderName=app}, {fileName=LocalDistributor.java, moduleVersion=null, moduleName=null, nativeMethod=false, methodName=lambda$run$1, className=org.openqa.selenium.grid.distributor.local.LocalDistributor$NewSessionRunnable, lineNumber=707, classLoaderName=app}, {fileName=ThreadPoolExecutor.java, moduleVersion=11.0.15, moduleName=java.base, nativeMethod=false, methodName=runWorker, className=java.util.concurrent.ThreadPoolExecutor, lineNumber=1128, classLoaderName=null}, {fileName=ThreadPoolExecutor.java, moduleVersion=11.0.15, moduleName=java.base, nativeMethod=false, methodName=run, className=java.util.concurrent.ThreadPoolExecutor$Worker, lineNumber=628, classLoaderName=null}, {fileName=Thread.java, moduleVersion=11.0.15, moduleName=java.base, nativeMethod=false, methodName=run, className=java.lang.Thread, lineNumber=829, classLoaderName=null}]
        at java.base/jdk.internal.reflect.NativeConstructorAccessorImpl.newInstance0(Native Method)
        at java.base/jdk.internal.reflect.NativeConstructorAccessorImpl.newInstance(NativeConstructorAccessorImpl.java:62)
        at java.base/jdk.internal.reflect.DelegatingConstructorAccessorImpl.newInstance(DelegatingConstructorAccessorImpl.java:45)
        at java.base/java.lang.reflect.Constructor.newInstance(Constructor.java:490)
        at org.openqa.selenium.remote.W3CHandshakeResponse.lambda$errorHandler$0(W3CHandshakeResponse.java:62)
        at org.openqa.selenium.remote.HandshakeResponse.lambda$getResponseFunction$0(HandshakeResponse.java:30)
        at org.openqa.selenium.remote.ProtocolHandshake.lambda$createSession$0(ProtocolHandshake.java:126)
        at java.base/java.util.stream.ReferencePipeline$3$1.accept(ReferencePipeline.java:195)
        at java.base/java.util.Spliterators$ArraySpliterator.tryAdvance(Spliterators.java:958)
        at java.base/java.util.stream.ReferencePipeline.forEachWithCancel(ReferencePipeline.java:127)
        at java.base/java.util.stream.AbstractPipeline.copyIntoWithCancel(AbstractPipeline.java:502)
        at java.base/java.util.stream.AbstractPipeline.copyInto(AbstractPipeline.java:488)
        at java.base/java.util.stream.AbstractPipeline.wrapAndCopyInto(AbstractPipeline.java:474)
        at java.base/java.util.stream.FindOps$FindOp.evaluateSequential(FindOps.java:150)
        at java.base/java.util.stream.AbstractPipeline.evaluate(AbstractPipeline.java:234)
        at java.base/java.util.stream.ReferencePipeline.findFirst(ReferencePipeline.java:543)
        at org.openqa.selenium.remote.ProtocolHandshake.createSession(ProtocolHandshake.java:128)
        at org.openqa.selenium.remote.ProtocolHandshake.createSession(ProtocolHandshake.java:74)
        at org.openqa.selenium.remote.HttpCommandExecutor.execute(HttpCommandExecutor.java:136)
        at org.openqa.selenium.remote.RemoteWebDriver.execute(RemoteWebDriver.java:552)
        at org.openqa.selenium.remote.RemoteWebDriver.startSession(RemoteWebDriver.java:213)
        at org.openqa.selenium.remote.RemoteWebDriver.<init>(RemoteWebDriver.java:131)
        at org.openqa.selenium.remote.RemoteWebDriver.<init>(RemoteWebDriver.java:144)
        at org.jitsi.meet.test.web.WebParticipantFactory.startWebDriver(WebParticipantFactory.java:318)
        at org.jitsi.meet.test.web.WebParticipantFactory.doCreateParticipant(WebParticipantFactory.java:100)
        at org.jitsi.meet.test.web.WebParticipantFactory.doCreateParticipant(WebParticipantFactory.java:38)
        at org.jitsi.meet.test.base.ParticipantFactory.createParticipant(ParticipantFactory.java:35)
        at org.jitsi.meet.test.base.ParticipantHelper.createParticipant(ParticipantHelper.java:162)
        at org.jitsi.meet.test.base.ParticipantHelper.createParticipant(ParticipantHelper.java:113)
        at org.jitsi.meet.test.MalleusJitsificus$MalleusTask.join(MalleusJitsificus.java:452)
        at java.base/java.util.concurrent.Executors$RunnableAdapter.call(Executors.java:515)
        at java.base/java.util.concurrent.FutureTask.run(FutureTask.java:264)
        at java.base/java.util.concurrent.ScheduledThreadPoolExecutor$ScheduledFutureTask.run(ScheduledThreadPoolExecutor.java:304)
        ... 3 more
[16] End testMain.
[15] End testMain.
[ERROR] Tests run: 452, Failures: 2, Errors: 0, Skipped: 450, Time elapsed: 2.804 s <<< FAILURE! - in TestSuite
[ERROR] testMain(org.jitsi.meet.test.MalleusJitsificus)  Time elapsed: 1.844 s  <<< FAILURE!
java.lang.Exception: Failed with multiple errors. Throws the primary.
        at org.jitsi.meet.test.MalleusJitsificus.testMain(MalleusJitsificus.java:352)
Caused by: org.openqa.selenium.SessionNotCreatedException:
Could not start a new session. Could not start a new session. Error while creating session with the driver service. Stopping driver service: Could not start a new session. Response code 500. Message: unknown error: Chrome failed to start: exited abnormally.
  (unknown error: DevToolsActivePort file doesn't exist)
  (The process started from chrome location /usr/bin/google-chrome is no longer running, so ChromeDriver is assuming that Chrome has crashed.)
Build info: version: '4.1.4', revision: '535d840ee2'
System info: host: 'jitsi-sgn-01', ip: 'xxx.xxx.98.162', os.name: 'Linux', os.arch: 'amd64', os.version: '5.4.0-113-generic', java.version: '11.0.15'
Driver info: driver.version: unknown
Build info: version: '4.1.4', revision: '535d840ee2'
System info: host: 'jitsi-sgn-01', ip: 'xxx.xxx.98.162', os.name: 'Linux', os.arch: 'amd64', os.version: '5.4.0-113-generic', java.version: '11.0.15'
Driver info: driver.version: unknown
Build info: version: '4.1.4', revision: '535d840ee2'
System info: host: 'jitsi-sgh', ip: 'xxx.xxx.98.164', os.name: 'Linux', os.arch: 'amd64', os.version: '5.4.0-104-generic', java.version: '11.0.15'
Driver info: driver.version: unknown
Build info: version: '3.141.59', revision: 'e82be7d358', time: '2018-11-14T08:17:03'
System info: host: 'jitsi-loadtest', ip: 'xxx.xxx.98.166', os.name: 'Linux', os.arch: 'amd64', os.version: '5.4.0-113-generic', java.version: '11.0.15'
Driver info: driver.version: RemoteWebDriver
remote stacktrace: [{fileName=RemoteNode.java, moduleVersion=null, moduleName=null, nativeMethod=false, methodName=newSession, className=org.openqa.selenium.grid.node.remote.RemoteNode, lineNumber=150, classLoaderName=app}, {fileName=LocalDistributor.java, moduleVersion=null, moduleName=null, nativeMethod=false, methodName=startSession, className=org.openqa.selenium.grid.distributor.local.LocalDistributor, lineNumber=609, classLoaderName=app}, {fileName=LocalDistributor.java, moduleVersion=null, moduleName=null, nativeMethod=false, methodName=newSession, className=org.openqa.selenium.grid.distributor.local.LocalDistributor, lineNumber=535, classLoaderName=app}, {fileName=LocalDistributor.java, moduleVersion=null, moduleName=null, nativeMethod=false, methodName=handleNewSessionRequest, className=org.openqa.selenium.grid.distributor.local.LocalDistributor$NewSessionRunnable, lineNumber=746, classLoaderName=app}, {fileName=LocalDistributor.java, moduleVersion=null, moduleName=null, nativeMethod=false, methodName=lambda$run$1, className=org.openqa.selenium.grid.distributor.local.LocalDistributor$NewSessionRunnable, lineNumber=707, classLoaderName=app}, {fileName=ThreadPoolExecutor.java, moduleVersion=11.0.15, moduleName=java.base, nativeMethod=false, methodName=runWorker, className=java.util.concurrent.ThreadPoolExecutor, lineNumber=1128, classLoaderName=null}, {fileName=ThreadPoolExecutor.java, moduleVersion=11.0.15, moduleName=java.base, nativeMethod=false, methodName=run, className=java.util.concurrent.ThreadPoolExecutor$Worker, lineNumber=628, classLoaderName=null}, {fileName=Thread.java, moduleVersion=11.0.15, moduleName=java.base, nativeMethod=false, methodName=run, className=java.lang.Thread, lineNumber=829, classLoaderName=null}]
[ERROR] testMain(org.jitsi.meet.test.MalleusJitsificus)  Time elapsed: 1.848 s  <<< FAILURE!
java.lang.Exception: Failed with multiple errors. Throws the primary.
        at org.jitsi.meet.test.MalleusJitsificus.testMain(MalleusJitsificus.java:352)
Caused by: org.openqa.selenium.SessionNotCreatedException:
Could not start a new session. Could not start a new session. Error while creating session with the driver service. Stopping driver service: Could not start a new session. Response code 500. Message: unknown error: Chrome failed to start: exited abnormally.
  (unknown error: DevToolsActivePort file doesn't exist)
  (The process started from chrome location /usr/bin/google-chrome is no longer running, so ChromeDriver is assuming that Chrome has crashed.)
Build info: version: '4.1.4', revision: '535d840ee2'
System info: host: 'jitsi-sgn-01', ip: 'xxx.xxx.98.162', os.name: 'Linux', os.arch: 'amd64', os.version: '5.4.0-113-generic', java.version: '11.0.15'
Driver info: driver.version: unknown
Build info: version: '4.1.4', revision: '535d840ee2'
System info: host: 'jitsi-sgn-01', ip: 'xxx.xxx.98.162', os.name: 'Linux', os.arch: 'amd64', os.version: '5.4.0-113-generic', java.version: '11.0.15'
Driver info: driver.version: unknown
Build info: version: '4.1.4', revision: '535d840ee2'
System info: host: 'jitsi-sgh', ip: 'xxx.xxx.98.164', os.name: 'Linux', os.arch: 'amd64', os.version: '5.4.0-104-generic', java.version: '11.0.15'
Driver info: driver.version: unknown
Build info: version: '3.141.59', revision: 'e82be7d358', time: '2018-11-14T08:17:03'
System info: host: 'jitsi-loadtest', ip: 'xxx.xxx.98.166', os.name: 'Linux', os.arch: 'amd64', os.version: '5.4.0-113-generic', java.version: '11.0.15'
Driver info: driver.version: RemoteWebDriver
remote stacktrace: [{fileName=RemoteNode.java, moduleVersion=null, moduleName=null, nativeMethod=false, methodName=newSession, className=org.openqa.selenium.grid.node.remote.RemoteNode, lineNumber=150, classLoaderName=app}, {fileName=LocalDistributor.java, moduleVersion=null, moduleName=null, nativeMethod=false, methodName=startSession, className=org.openqa.selenium.grid.distributor.local.LocalDistributor, lineNumber=609, classLoaderName=app}, {fileName=LocalDistributor.java, moduleVersion=null, moduleName=null, nativeMethod=false, methodName=newSession, className=org.openqa.selenium.grid.distributor.local.LocalDistributor, lineNumber=535, classLoaderName=app}, {fileName=LocalDistributor.java, moduleVersion=null, moduleName=null, nativeMethod=false, methodName=handleNewSessionRequest, className=org.openqa.selenium.grid.distributor.local.LocalDistributor$NewSessionRunnable, lineNumber=746, classLoaderName=app}, {fileName=LocalDistributor.java, moduleVersion=null, moduleName=null, nativeMethod=false, methodName=lambda$run$1, className=org.openqa.selenium.grid.distributor.local.LocalDistributor$NewSessionRunnable, lineNumber=707, classLoaderName=app}, {fileName=ThreadPoolExecutor.java, moduleVersion=11.0.15, moduleName=java.base, nativeMethod=false, methodName=runWorker, className=java.util.concurrent.ThreadPoolExecutor, lineNumber=1128, classLoaderName=null}, {fileName=ThreadPoolExecutor.java, moduleVersion=11.0.15, moduleName=java.base, nativeMethod=false, methodName=run, className=java.util.concurrent.ThreadPoolExecutor$Worker, lineNumber=628, classLoaderName=null}, {fileName=Thread.java, moduleVersion=11.0.15, moduleName=java.base, nativeMethod=false, methodName=run, className=java.lang.Thread, lineNumber=829, classLoaderName=null}]
[INFO]
[INFO] Results:
[INFO]
[ERROR] Failures:
[ERROR] org.jitsi.meet.test.MalleusJitsificus.testMain(org.jitsi.meet.test.MalleusJitsificus)
[ERROR]   Run 1: MalleusJitsificus.testMain:352  Failed with multiple errors. Throws the primar...
[ERROR]   Run 2: MalleusJitsificus.testMain:352  Failed with multiple errors. Throws the primar...
[INFO]
[INFO]
[ERROR] Tests run: 447, Failures: 1, Errors: 0, Skipped: 446
[INFO]
[INFO] ------------------------------------------------------------------------
[INFO] BUILD FAILURE
[INFO] ------------------------------------------------------------------------
[INFO] Total time:  4.545 s
[INFO] Finished at: 2022-06-08T08:37:33+02:00
[INFO] ------------------------------------------------------------------------
[ERROR] Failed to execute goal org.apache.maven.plugins:maven-surefire-plugin:2.22.2:test (default-test) on project jitsi-meet-torture: There are test failures.
[ERROR]
[ERROR] Please refer to /usr/share/jitsi-meet/jitsi-meet-torture/target/surefire-reports for the individual test results.
[ERROR] Please refer to dump files (if any exist) [date].dump, [date]-jvmRun[N].dump and [date].dumpstream.
[ERROR] -> [Help 1]
[ERROR]
[ERROR] To see the full stack trace of the errors, re-run Maven with the -e switch.
[ERROR] Re-run Maven using the -X switch to enable full debug logging.
[ERROR]
[ERROR] For more information about the errors and possible solutions, please read the following articles:
[ERROR] [Help 1] http://cwiki.apache.org/confluence/display/MAVEN/MojoFailureException

Do you have enough RAM and CPU on that machine to run 4 chrome instances?

We have 4 CPU and 8Gb RAM. Is it enough?

For two chrome instances this maybe enough.