Jitsi-meet compile issues

Hi everyone!
So I’m following this tutorial: [How to] How to build Jitsi Meet from source: A developer's guide

on how to develop with Jitsi and setup a dev environment. I’m almost done, currently on step 5 which calls to run make. I tried the command already both full and separate using:

npm install lib-jitsi-meet --force && make

The npm install part works, and I can run Jitsi on my computer properly from the repository. But when running the make command I get 138 errors related to i18next and react-i18next.
I’m running the system on an Ubutntu Linux 20 VPS with nginx

Error log is:

ERROR in ./react/features/base/icons/svg/visibility.svg
Module build failed (from ./node_modules/@ svgr/webpack/lib/index.js):
Error: Cannot find module ‘./util’
Require stack:

  • jitsi-meet/node_modules/svgo/node_modules/source-map/lib/source-map-generator.js
  • jitsi-meet/node_modules/svgo/node_modules/css-tree/lib/generator/sourceMap.js
  • jitsi-meet/node_modules/svgo/node_modules/css-tree/lib/generator/create.js
  • jitsi-meet/node_modules/svgo/node_modules/css-tree/lib/syntax/create.js
  • jitsi-meet/node_modules/svgo/node_modules/css-tree/lib/syntax/index.js
  • jitsi-meet/node_modules/svgo/node_modules/css-tree/lib/index.js
  • jitsi-meet/node_modules/svgo/lib/svgo/css-style-declaration.js
  • jitsi-meet/node_modules/svgo/lib/svgo/svg2js.js
  • jitsi-meet/node_modules/svgo/lib/svgo.js
  • jitsi-meet/node_modules/@ svgr/plugin-svgo/lib/index.js
  • jitsi-meet/node_modules/@ svgr/webpack/lib/index.js
  • jitsi-meet/node_modules/loader-runner/lib/loadLoader.js
  • jitsi-meet/node_modules/loader-runner/lib/LoaderRunner.js
  • jitsi-meet/node_modules/webpack/lib/NormalModuleFactory.js
  • jitsi-meet/node_modules/webpack/lib/Compiler.js
  • jitsi-meet/node_modules/webpack/lib/webpack.js
  • jitsi-meet/node_modules/webpack/lib/index.js
  • jitsi-meet/node_modules/webpack-cli/lib/webpack-cli.js
  • jitsi-meet/node_modules/webpack-cli/lib/bootstrap.js
  • jitsi-meet/node_modules/webpack-cli/bin/cli.js
  • jitsi-meet/node_modules/webpack/bin/webpack.js
    at Function.Module._resolveFilename (node:internal/modules/cjs/loader:933:15)
    at Function.Module._load (node:internal/modules/cjs/loader:778:27)
    at Module.require (node:internal/modules/cjs/loader:1005:19)
    at require (jitsi-meet/node_modules/v8-compile-cache/v8-compile-cache.js:159:20)
    at Object. (jitsi-meet/node_modules/svgo/node_modules/source-map/lib/source-map-generator.js:9:12)
    at Module._compile (jitsi-meet/node_modules/v8-compile-cache/v8-compile-cache.js:192:30)
    at Object.Module._extensions…js (node:internal/modules/cjs/loader:1153:10)
    at Module.load (node:internal/modules/cjs/loader:981:32)
    at Function.Module._load (node:internal/modules/cjs/loader:822:12)
    at Module.require (node:internal/modules/cjs/loader:1005:19)
    @ ./react/features/base/icons/svg/index.js 12:0-60 12:0-60
    @ ./react/features/base/icons/index.js 2:0-22 2:0-22
    @ ./react/features/invite/components/dial-in-summary/web/NumbersList.js 3:0-55 115:66-70 116:13-20
    @ ./react/features/invite/components/dial-in-summary/web/DialInSummary.js 7:0-40 87:50-61
    @ ./react/features/invite/components/dial-in-summary/web/index.js 1:0-59 1:0-59
    @ ./react/features/invite/components/dial-in-summary/index.web.js 1:0-22 1:0-22
    @ ./react/features/invite/components/dial-in-info-page/DialInInfoApp.web.js 7:0-51 15:45-58
    @ ./react/features/invite/components/dial-in-info-page/index.js 2:0-25

ERROR in ./react/features/base/icons/svg/volume-empty.svg
Module build failed (from ./node_modules/@ svgr/webpack/lib/index.js):
Error: Cannot find module ‘./util’
Require stack:

  • jitsi-meet/node_modules/svgo/node_modules/source-map/lib/source-map-generator.js
  • jitsi-meet/node_modules/svgo/node_modules/css-tree/lib/generator/sourceMap.js
  • jitsi-meet/node_modules/svgo/node_modules/css-tree/lib/generator/create.js
  • jitsi-meet/node_modules/svgo/node_modules/css-tree/lib/syntax/create.js
  • jitsi-meet/node_modules/svgo/node_modules/css-tree/lib/syntax/index.js
  • jitsi-meet/node_modules/svgo/node_modules/css-tree/lib/index.js
  • jitsi-meet/node_modules/svgo/lib/svgo/css-style-declaration.js
  • jitsi-meet/node_modules/svgo/lib/svgo/svg2js.js
  • jitsi-meet/node_modules/svgo/lib/svgo.js
  • jitsi-meet/node_modules/@ svgr/plugin-svgo/lib/index.js
  • jitsi-meet/node_modules/@ svgr/webpack/lib/index.js
  • jitsi-meet/node_modules/loader-runner/lib/loadLoader.js
  • jitsi-meet/node_modules/loader-runner/lib/LoaderRunner.js
  • jitsi-meet/node_modules/webpack/lib/NormalModuleFactory.js
  • jitsi-meet/node_modules/webpack/lib/Compiler.js
  • jitsi-meet/node_modules/webpack/lib/webpack.js
  • jitsi-meet/node_modules/webpack/lib/index.js
  • jitsi-meet/node_modules/webpack-cli/lib/webpack-cli.js
  • jitsi-meet/node_modules/webpack-cli/lib/bootstrap.js
  • jitsi-meet/node_modules/webpack-cli/bin/cli.js
  • jitsi-meet/node_modules/webpack/bin/webpack.js
    at Function.Module._resolveFilename (node:internal/modules/cjs/loader:933:15)
    at Function.Module._load (node:internal/modules/cjs/loader:778:27)
    at Module.require (node:internal/modules/cjs/loader:1005:19)
    at require (jitsi-meet/node_modules/v8-compile-cache/v8-compile-cache.js:159:20)
    at Object. (jitsi-meet/node_modules/svgo/node_modules/source-map/lib/source-map-generator.js:9:12)
    at Module._compile (jitsi-meet/node_modules/v8-compile-cache/v8-compile-cache.js:192:30)
    at Object.Module._extensions…js (node:internal/modules/cjs/loader:1153:10)
    at Module.load (node:internal/modules/cjs/loader:981:32)
    at Function.Module._load (node:internal/modules/cjs/loader:822:12)
    at Module.require (node:internal/modules/cjs/loader:1005:19)
    @ ./react/features/base/icons/svg/index.js 131:0-64 131:0-64
    @ ./react/features/base/icons/index.js 2:0-22 2:0-22
    @ ./react/features/invite/components/dial-in-summary/web/NumbersList.js 3:0-55 115:66-70 116:13-20
    @ ./react/features/invite/components/dial-in-summary/web/DialInSummary.js 7:0-40 87:50-61
    @ ./react/features/invite/components/dial-in-summary/web/index.js 1:0-59 1:0-59
    @ ./react/features/invite/components/dial-in-summary/index.web.js 1:0-22 1:0-22
    @ ./react/features/invite/components/dial-in-info-page/DialInInfoApp.web.js 7:0-51 15:45-58
    @ ./react/features/invite/components/dial-in-info-page/index.js 2:0-25

ERROR in ./react/features/base/icons/svg/volume-off.svg
Module build failed (from ./node_modules/@ svgr/webpack/lib/index.js):
Error: Cannot find module ‘./util’
Require stack:

  • jitsi-meet/node_modules/svgo/node_modules/source-map/lib/source-map-generator.js
  • jitsi-meet/node_modules/svgo/node_modules/css-tree/lib/generator/sourceMap.js
  • jitsi-meet/node_modules/svgo/node_modules/css-tree/lib/generator/create.js
  • jitsi-meet/node_modules/svgo/node_modules/css-tree/lib/syntax/create.js
  • jitsi-meet/node_modules/svgo/node_modules/css-tree/lib/syntax/index.js
  • jitsi-meet/node_modules/svgo/node_modules/css-tree/lib/index.js
  • jitsi-meet/node_modules/svgo/lib/svgo/css-style-declaration.js
  • jitsi-meet/node_modules/svgo/lib/svgo/svg2js.js
  • jitsi-meet/node_modules/svgo/lib/svgo.js
  • jitsi-meet/node_modules/@ svgr/plugin-svgo/lib/index.js
  • jitsi-meet/node_modules/@ svgr/webpack/lib/index.js
  • jitsi-meet/node_modules/loader-runner/lib/loadLoader.js
  • jitsi-meet/node_modules/loader-runner/lib/LoaderRunner.js
  • jitsi-meet/node_modules/webpack/lib/NormalModuleFactory.js
  • jitsi-meet/node_modules/webpack/lib/Compiler.js
  • jitsi-meet/node_modules/webpack/lib/webpack.js
  • jitsi-meet/node_modules/webpack/lib/index.js
  • jitsi-meet/node_modules/webpack-cli/lib/webpack-cli.js
  • jitsi-meet/node_modules/webpack-cli/lib/bootstrap.js
  • jitsi-meet/node_modules/webpack-cli/bin/cli.js
  • jitsi-meet/node_modules/webpack/bin/webpack.js
    at Function.Module._resolveFilename (node:internal/modules/cjs/loader:933:15)
    at Function.Module._load (node:internal/modules/cjs/loader:778:27)
    at Module.require (node:internal/modules/cjs/loader:1005:19)
    at require (jitsi-meet/node_modules/v8-compile-cache/v8-compile-cache.js:159:20)
    at Object. (jitsi-meet/node_modules/svgo/node_modules/source-map/lib/source-map-generator.js:9:12)
    at Module._compile (jitsi-meet/node_modules/v8-compile-cache/v8-compile-cache.js:192:30)
    at Object.Module._extensions…js (node:internal/modules/cjs/loader:1153:10)
    at Module.load (node:internal/modules/cjs/loader:981:32)
    at Function.Module._load (node:internal/modules/cjs/loader:822:12)
    at Module.require (node:internal/modules/cjs/loader:1005:19)
    @ ./react/features/base/icons/svg/index.js 132:0-60 132:0-60
    @ ./react/features/base/icons/index.js 2:0-22 2:0-22
    @ ./react/features/invite/components/dial-in-summary/web/NumbersList.js 3:0-55 115:66-70 116:13-20
    @ ./react/features/invite/components/dial-in-summary/web/DialInSummary.js 7:0-40 87:50-61
    @ ./react/features/invite/components/dial-in-summary/web/index.js 1:0-59 1:0-59
    @ ./react/features/invite/components/dial-in-summary/index.web.js 1:0-22 1:0-22
    @ ./react/features/invite/components/dial-in-info-page/DialInInfoApp.web.js 7:0-51 15:45-58
    @ ./react/features/invite/components/dial-in-info-page/index.js 2:0-25

ERROR in ./react/features/base/icons/svg/volume.svg
Module build failed (from ./node_modules/@ svgr/webpack/lib/index.js):
Error: Cannot find module ‘./util’
Require stack:

  • jitsi-meet/node_modules/svgo/node_modules/source-map/lib/source-map-generator.js
  • jitsi-meet/node_modules/svgo/node_modules/css-tree/lib/generator/sourceMap.js
  • jitsi-meet/node_modules/svgo/node_modules/css-tree/lib/generator/create.js
  • jitsi-meet/node_modules/svgo/node_modules/css-tree/lib/syntax/create.js
  • jitsi-meet/node_modules/svgo/node_modules/css-tree/lib/syntax/index.js
  • jitsi-meet/node_modules/svgo/node_modules/css-tree/lib/index.js
  • jitsi-meet/node_modules/svgo/lib/svgo/css-style-declaration.js
  • jitsi-meet/node_modules/svgo/lib/svgo/svg2js.js
  • jitsi-meet/node_modules/svgo/lib/svgo.js
  • jitsi-meet/node_modules/@ svgr/plugin-svgo/lib/index.js
  • jitsi-meet/node_modules/@ svgr/webpack/lib/index.js
  • jitsi-meet/node_modules/loader-runner/lib/loadLoader.js
  • jitsi-meet/node_modules/loader-runner/lib/LoaderRunner.js
  • jitsi-meet/node_modules/webpack/lib/NormalModuleFactory.js
  • jitsi-meet/node_modules/webpack/lib/Compiler.js
  • jitsi-meet/node_modules/webpack/lib/webpack.js
  • jitsi-meet/node_modules/webpack/lib/index.js
  • jitsi-meet/node_modules/webpack-cli/lib/webpack-cli.js
  • jitsi-meet/node_modules/webpack-cli/lib/bootstrap.js
  • jitsi-meet/node_modules/webpack-cli/bin/cli.js
  • jitsi-meet/node_modules/webpack/bin/webpack.js
    at Function.Module._resolveFilename (node:internal/modules/cjs/loader:933:15)
    at Function.Module._load (node:internal/modules/cjs/loader:778:27)
    at Module.require (node:internal/modules/cjs/loader:1005:19)
    at require (jitsi-meet/node_modules/v8-compile-cache/v8-compile-cache.js:159:20)
    at Object. (jitsi-meet/node_modules/svgo/node_modules/source-map/lib/source-map-generator.js:9:12)
    at Module._compile (jitsi-meet/node_modules/v8-compile-cache/v8-compile-cache.js:192:30)
    at Object.Module._extensions…js (node:internal/modules/cjs/loader:1153:10)
    at Module.load (node:internal/modules/cjs/loader:981:32)
    at Function.Module._load (node:internal/modules/cjs/loader:822:12)
    at Module.require (node:internal/modules/cjs/loader:1005:19)
    @ ./react/features/base/icons/svg/index.js 14:0-57 14:0-57 43:0-60 43:0-60 130:0-53 130:0-53
    @ ./react/features/base/icons/index.js 2:0-22 2:0-22
    @ ./react/features/invite/components/dial-in-summary/web/NumbersList.js 3:0-55 115:66-70 116:13-20
    @ ./react/features/invite/components/dial-in-summary/web/DialInSummary.js 7:0-40 87:50-61
    @ ./react/features/invite/components/dial-in-summary/web/index.js 1:0-59 1:0-59
    @ ./react/features/invite/components/dial-in-summary/index.web.js 1:0-22 1:0-22
    @ ./react/features/invite/components/dial-in-info-page/DialInInfoApp.web.js 7:0-51 15:45-58
    @ ./react/features/invite/components/dial-in-info-page/index.js 2:0-25

ERROR in ./react/features/base/icons/svg/warning.svg
Module build failed (from ./node_modules/@ svgr/webpack/lib/index.js):
Error: Cannot find module ‘./util’
Require stack:

  • jitsi-meet/node_modules/svgo/node_modules/source-map/lib/source-map-generator.js
  • jitsi-meet/node_modules/svgo/node_modules/css-tree/lib/generator/sourceMap.js
  • jitsi-meet/node_modules/svgo/node_modules/css-tree/lib/generator/create.js
  • jitsi-meet/node_modules/svgo/node_modules/css-tree/lib/syntax/create.js
  • jitsi-meet/node_modules/svgo/node_modules/css-tree/lib/syntax/index.js
  • jitsi-meet/node_modules/svgo/node_modules/css-tree/lib/index.js
  • jitsi-meet/node_modules/svgo/lib/svgo/css-style-declaration.js
  • jitsi-meet/node_modules/svgo/lib/svgo/svg2js.js
  • jitsi-meet/node_modules/svgo/lib/svgo.js
  • jitsi-meet/node_modules/@ svgr/plugin-svgo/lib/index.js
  • jitsi-meet/node_modules/@ svgr/webpack/lib/index.js
  • jitsi-meet/node_modules/loader-runner/lib/loadLoader.js
  • jitsi-meet/node_modules/loader-runner/lib/LoaderRunner.js
  • jitsi-meet/node_modules/webpack/lib/NormalModuleFactory.js
  • jitsi-meet/node_modules/webpack/lib/Compiler.js
  • jitsi-meet/node_modules/webpack/lib/webpack.js
  • jitsi-meet/node_modules/webpack/lib/index.js
  • jitsi-meet/node_modules/webpack-cli/lib/webpack-cli.js
  • jitsi-meet/node_modules/webpack-cli/lib/bootstrap.js
  • jitsi-meet/node_modules/webpack-cli/bin/cli.js
  • jitsi-meet/node_modules/webpack/bin/webpack.js
    at Function.Module._resolveFilename (node:internal/modules/cjs/loader:933:15)
    at Function.Module._load (node:internal/modules/cjs/loader:778:27)
    at Module.require (node:internal/modules/cjs/loader:1005:19)
    at require (jitsi-meet/node_modules/v8-compile-cache/v8-compile-cache.js:159:20)
    at Object. (jitsi-meet/node_modules/svgo/node_modules/source-map/lib/source-map-generator.js:9:12)
    at Module._compile (jitsi-meet/node_modules/v8-compile-cache/v8-compile-cache.js:192:30)
    at Object.Module._extensions…js (node:internal/modules/cjs/loader:1153:10)
    at Module.load (node:internal/modules/cjs/loader:981:32)
    at Function.Module._load (node:internal/modules/cjs/loader:822:12)
    at Module.require (node:internal/modules/cjs/loader:1005:19)
    @ ./react/features/base/icons/svg/index.js 133:0-55 133:0-55
    @ ./react/features/base/icons/index.js 2:0-22 2:0-22
    @ ./react/features/invite/components/dial-in-summary/web/NumbersList.js 3:0-55 115:66-70 116:13-20
    @ ./react/features/invite/components/dial-in-summary/web/DialInSummary.js 7:0-40 87:50-61
    @ ./react/features/invite/components/dial-in-summary/web/index.js 1:0-59 1:0-59
    @ ./react/features/invite/components/dial-in-summary/index.web.js 1:0-22 1:0-22
    @ ./react/features/invite/components/dial-in-info-page/DialInInfoApp.web.js 7:0-51 15:45-58
    @ ./react/features/invite/components/dial-in-info-page/index.js 2:0-25

ERROR in ./react/features/base/icons/svg/wifi-1.svg
Module build failed (from ./node_modules/@ svgr/webpack/lib/index.js):
Error: Cannot find module ‘./util’
Require stack:

  • jitsi-meet/node_modules/svgo/node_modules/source-map/lib/source-map-generator.js
  • jitsi-meet/node_modules/svgo/node_modules/css-tree/lib/generator/sourceMap.js
  • jitsi-meet/node_modules/svgo/node_modules/css-tree/lib/generator/create.js
  • jitsi-meet/node_modules/svgo/node_modules/css-tree/lib/syntax/create.js
  • jitsi-meet/node_modules/svgo/node_modules/css-tree/lib/syntax/index.js
  • jitsi-meet/node_modules/svgo/node_modules/css-tree/lib/index.js
  • jitsi-meet/node_modules/svgo/lib/svgo/css-style-declaration.js
  • jitsi-meet/node_modules/svgo/lib/svgo/svg2js.js
  • jitsi-meet/node_modules/svgo/lib/svgo.js
  • jitsi-meet/node_modules/@ svgr/plugin-svgo/lib/index.js
  • jitsi-meet/node_modules/@ svgr/webpack/lib/index.js
  • jitsi-meet/node_modules/loader-runner/lib/loadLoader.js
  • jitsi-meet/node_modules/loader-runner/lib/LoaderRunner.js
  • jitsi-meet/node_modules/webpack/lib/NormalModuleFactory.js
  • jitsi-meet/node_modules/webpack/lib/Compiler.js
  • jitsi-meet/node_modules/webpack/lib/webpack.js
  • jitsi-meet/node_modules/webpack/lib/index.js
  • jitsi-meet/node_modules/webpack-cli/lib/webpack-cli.js
  • jitsi-meet/node_modules/webpack-cli/lib/bootstrap.js
  • jitsi-meet/node_modules/webpack-cli/bin/cli.js
  • jitsi-meet/node_modules/webpack/bin/webpack.js
    at Function.Module._resolveFilename (node:internal/modules/cjs/loader:933:15)
    at Function.Module._load (node:internal/modules/cjs/loader:778:27)
    at Module.require (node:internal/modules/cjs/loader:1005:19)
    at require (jitsi-meet/node_modules/v8-compile-cache/v8-compile-cache.js:159:20)
    at Object. (jitsi-meet/node_modules/svgo/node_modules/source-map/lib/source-map-generator.js:9:12)
    at Module._compile (jitsi-meet/node_modules/v8-compile-cache/v8-compile-cache.js:192:30)
    at Object.Module._extensions…js (node:internal/modules/cjs/loader:1153:10)
    at Module.load (node:internal/modules/cjs/loader:981:32)
    at Function.Module._load (node:internal/modules/cjs/loader:822:12)
    at Module.require (node:internal/modules/cjs/loader:1005:19)
    @ ./react/features/base/icons/svg/index.js 134:0-55 134:0-55
    @ ./react/features/base/icons/index.js 2:0-22 2:0-22
    @ ./react/features/invite/components/dial-in-summary/web/NumbersList.js 3:0-55 115:66-70 116:13-20
    @ ./react/features/invite/components/dial-in-summary/web/DialInSummary.js 7:0-40 87:50-61
    @ ./react/features/invite/components/dial-in-summary/web/index.js 1:0-59 1:0-59
    @ ./react/features/invite/components/dial-in-summary/index.web.js 1:0-22 1:0-22
    @ ./react/features/invite/components/dial-in-info-page/DialInInfoApp.web.js 7:0-51 15:45-58
    @ ./react/features/invite/components/dial-in-info-page/index.js 2:0-25

ERROR in ./react/features/base/icons/svg/wifi-2.svg
Module build failed (from ./node_modules/@ svgr/webpack/lib/index.js):
Error: Cannot find module ‘./util’
Require stack:

  • jitsi-meet/node_modules/svgo/node_modules/source-map/lib/source-map-generator.js
  • jitsi-meet/node_modules/svgo/node_modules/css-tree/lib/generator/sourceMap.js
  • jitsi-meet/node_modules/svgo/node_modules/css-tree/lib/generator/create.js
  • jitsi-meet/node_modules/svgo/node_modules/css-tree/lib/syntax/create.js
  • jitsi-meet/node_modules/svgo/node_modules/css-tree/lib/syntax/index.js
  • jitsi-meet/node_modules/svgo/node_modules/css-tree/lib/index.js
  • jitsi-meet/node_modules/svgo/lib/svgo/css-style-declaration.js
  • jitsi-meet/node_modules/svgo/lib/svgo/svg2js.js
  • jitsi-meet/node_modules/svgo/lib/svgo.js
  • jitsi-meet/node_modules/@ svgr/plugin-svgo/lib/index.js
  • jitsi-meet/node_modules/@ svgr/webpack/lib/index.js
  • jitsi-meet/node_modules/loader-runner/lib/loadLoader.js
  • jitsi-meet/node_modules/loader-runner/lib/LoaderRunner.js
  • jitsi-meet/node_modules/webpack/lib/NormalModuleFactory.js
  • jitsi-meet/node_modules/webpack/lib/Compiler.js
  • jitsi-meet/node_modules/webpack/lib/webpack.js
  • jitsi-meet/node_modules/webpack/lib/index.js
  • jitsi-meet/node_modules/webpack-cli/lib/webpack-cli.js
  • jitsi-meet/node_modules/webpack-cli/lib/bootstrap.js
  • jitsi-meet/node_modules/webpack-cli/bin/cli.js
  • jitsi-meet/node_modules/webpack/bin/webpack.js
    at Function.Module._resolveFilename (node:internal/modules/cjs/loader:933:15)
    at Function.Module._load (node:internal/modules/cjs/loader:778:27)
    at Module.require (node:internal/modules/cjs/loader:1005:19)
    at require (jitsi-meet/node_modules/v8-compile-cache/v8-compile-cache.js:159:20)
    at Object. (jitsi-meet/node_modules/svgo/node_modules/source-map/lib/source-map-generator.js:9:12)
    at Module._compile (jitsi-meet/node_modules/v8-compile-cache/v8-compile-cache.js:192:30)
    at Object.Module._extensions…js (node:internal/modules/cjs/loader:1153:10)
    at Module.load (node:internal/modules/cjs/loader:981:32)
    at Function.Module._load (node:internal/modules/cjs/loader:822:12)
    at Module.require (node:internal/modules/cjs/loader:1005:19)
    @ ./react/features/base/icons/svg/index.js 135:0-56 135:0-56
    @ ./react/features/base/icons/index.js 2:0-22 2:0-22
    @ ./react/features/invite/components/dial-in-summary/web/NumbersList.js 3:0-55 115:66-70 116:13-20
    @ ./react/features/invite/components/dial-in-summary/web/DialInSummary.js 7:0-40 87:50-61
    @ ./react/features/invite/components/dial-in-summary/web/index.js 1:0-59 1:0-59
    @ ./react/features/invite/components/dial-in-summary/index.web.js 1:0-22 1:0-22
    @ ./react/features/invite/components/dial-in-info-page/DialInInfoApp.web.js 7:0-51 15:45-58
    @ ./react/features/invite/components/dial-in-info-page/index.js 2:0-25

ERROR in ./react/features/base/icons/svg/wifi-3.svg
Module build failed (from ./node_modules/@ svgr/webpack/lib/index.js):
Error: Cannot find module ‘./util’
Require stack:

  • jitsi-meet/node_modules/svgo/node_modules/source-map/lib/source-map-generator.js
  • jitsi-meet/node_modules/svgo/node_modules/css-tree/lib/generator/sourceMap.js
  • jitsi-meet/node_modules/svgo/node_modules/css-tree/lib/generator/create.js
  • jitsi-meet/node_modules/svgo/node_modules/css-tree/lib/syntax/create.js
  • jitsi-meet/node_modules/svgo/node_modules/css-tree/lib/syntax/index.js
  • jitsi-meet/node_modules/svgo/node_modules/css-tree/lib/index.js
  • jitsi-meet/node_modules/svgo/lib/svgo/css-style-declaration.js
  • jitsi-meet/node_modules/svgo/lib/svgo/svg2js.js
  • jitsi-meet/node_modules/svgo/lib/svgo.js
  • jitsi-meet/node_modules/@ svgr/plugin-svgo/lib/index.js
  • jitsi-meet/node_modules/@ svgr/webpack/lib/index.js
  • jitsi-meet/node_modules/loader-runner/lib/loadLoader.js
  • jitsi-meet/node_modules/loader-runner/lib/LoaderRunner.js
  • jitsi-meet/node_modules/webpack/lib/NormalModuleFactory.js
  • jitsi-meet/node_modules/webpack/lib/Compiler.js
  • jitsi-meet/node_modules/webpack/lib/webpack.js
  • jitsi-meet/node_modules/webpack/lib/index.js
  • jitsi-meet/node_modules/webpack-cli/lib/webpack-cli.js
  • jitsi-meet/node_modules/webpack-cli/lib/bootstrap.js
  • jitsi-meet/node_modules/webpack-cli/bin/cli.js
  • jitsi-meet/node_modules/webpack/bin/webpack.js
    at Function.Module._resolveFilename (node:internal/modules/cjs/loader:933:15)
    at Function.Module._load (node:internal/modules/cjs/loader:778:27)
    at Module.require (node:internal/modules/cjs/loader:1005:19)
    at require (jitsi-meet/node_modules/v8-compile-cache/v8-compile-cache.js:159:20)
    at Object. (jitsi-meet/node_modules/svgo/node_modules/source-map/lib/source-map-generator.js:9:12)
    at Module._compile (jitsi-meet/node_modules/v8-compile-cache/v8-compile-cache.js:192:30)
    at Object.Module._extensions…js (node:internal/modules/cjs/loader:1153:10)
    at Module.load (node:internal/modules/cjs/loader:981:32)
    at Function.Module._load (node:internal/modules/cjs/loader:822:12)
    at Module.require (node:internal/modules/cjs/loader:1005:19)
    @ ./react/features/base/icons/svg/index.js 136:0-56 136:0-56
    @ ./react/features/base/icons/index.js 2:0-22 2:0-22
    @ ./react/features/invite/components/dial-in-summary/web/NumbersList.js 3:0-55 115:66-70 116:13-20
    @ ./react/features/invite/components/dial-in-summary/web/DialInSummary.js 7:0-40 87:50-61
    @ ./react/features/invite/components/dial-in-summary/web/index.js 1:0-59 1:0-59
    @ ./react/features/invite/components/dial-in-summary/index.web.js 1:0-22 1:0-22
    @ ./react/features/invite/components/dial-in-info-page/DialInInfoApp.web.js 7:0-51 15:45-58
    @ ./react/features/invite/components/dial-in-info-page/index.js 2:0-25

ERROR in ./react/features/base/icons/svg/yahoo.svg
Module build failed (from ./node_modules/@ svgr/webpack/lib/index.js):
Error: Cannot find module ‘./util’
Require stack:

  • jitsi-meet/node_modules/svgo/node_modules/source-map/lib/source-map-generator.js
  • jitsi-meet/node_modules/svgo/node_modules/css-tree/lib/generator/sourceMap.js
  • jitsi-meet/node_modules/svgo/node_modules/css-tree/lib/generator/create.js
  • jitsi-meet/node_modules/svgo/node_modules/css-tree/lib/syntax/create.js
  • jitsi-meet/node_modules/svgo/node_modules/css-tree/lib/syntax/index.js
  • jitsi-meet/node_modules/svgo/node_modules/css-tree/lib/index.js
  • jitsi-meet/node_modules/svgo/lib/svgo/css-style-declaration.js
  • jitsi-meet/node_modules/svgo/lib/svgo/svg2js.js
  • jitsi-meet/node_modules/svgo/lib/svgo.js
  • jitsi-meet/node_modules/@ svgr/plugin-svgo/lib/index.js
  • jitsi-meet/node_modules/@ svgr/webpack/lib/index.js
  • jitsi-meet/node_modules/loader-runner/lib/loadLoader.js
  • jitsi-meet/node_modules/loader-runner/lib/LoaderRunner.js
  • jitsi-meet/node_modules/webpack/lib/NormalModuleFactory.js
  • jitsi-meet/node_modules/webpack/lib/Compiler.js
  • jitsi-meet/node_modules/webpack/lib/webpack.js
  • jitsi-meet/node_modules/webpack/lib/index.js
  • jitsi-meet/node_modules/webpack-cli/lib/webpack-cli.js
  • jitsi-meet/node_modules/webpack-cli/lib/bootstrap.js
  • jitsi-meet/node_modules/webpack-cli/bin/cli.js
  • jitsi-meet/node_modules/webpack/bin/webpack.js
    at Function.Module._resolveFilename (node:internal/modules/cjs/loader:933:15)
    at Function.Module._load (node:internal/modules/cjs/loader:778:27)
    at Module.require (node:internal/modules/cjs/loader:1005:19)
    at require (jitsi-meet/node_modules/v8-compile-cache/v8-compile-cache.js:159:20)
    at Object. (jitsi-meet/node_modules/svgo/node_modules/source-map/lib/source-map-generator.js:9:12)
    at Module._compile (jitsi-meet/node_modules/v8-compile-cache/v8-compile-cache.js:192:30)
    at Object.Module._extensions…js (node:internal/modules/cjs/loader:1153:10)
    at Module.load (node:internal/modules/cjs/loader:981:32)
    at Function.Module._load (node:internal/modules/cjs/loader:822:12)
    at Module.require (node:internal/modules/cjs/loader:1005:19)
    @ ./react/features/base/icons/svg/index.js 137:0-51 137:0-51
    @ ./react/features/base/icons/index.js 2:0-22 2:0-22
    @ ./react/features/invite/components/dial-in-summary/web/NumbersList.js 3:0-55 115:66-70 116:13-20
    @ ./react/features/invite/components/dial-in-summary/web/DialInSummary.js 7:0-40 87:50-61
    @ ./react/features/invite/components/dial-in-summary/web/index.js 1:0-59 1:0-59
    @ ./react/features/invite/components/dial-in-summary/index.web.js 1:0-22 1:0-22
    @ ./react/features/invite/components/dial-in-info-page/DialInInfoApp.web.js 7:0-51 15:45-58
    @ ./react/features/invite/components/dial-in-info-page/index.js 2:0-25

ERROR in ./node_modules/i18next-browser-languagedetector/index.js 2:11-54
Module not found: Error: Can’t resolve ‘./dist/commonjs/index.js’ in ‘jitsi-meet/node_modules/i18next-browser-languagedetector’
@ ./react/features/base/i18n/languageDetector.web.js 1:0-71 21:29-52
@ ./react/features/base/i18n/i18next.js 7:0-50 55:78-94
@ ./react/features/base/i18n/index.js 5:0-76 5:0-76 5:0-76 5:0-76
@ ./react/features/invite/components/dial-in-info-page/DialInInfoApp.web.js 5:0-45 14:10-17
@ ./react/features/invite/components/dial-in-info-page/index.js 2:0-25

ERROR in ./react/features/base/i18n/i18next.js 2:0-30
Module not found: Error: Can’t resolve ‘i18next’ in ‘jitsi-meet/react/features/base/i18n’
Did you mean ‘./i18next’?
Requests that should resolve in the current directory need to start with ‘./’.
Requests that start with a name are treated as module requests and resolve within module directories (node_modules).
If changing the source code is not an option there is also a resolve options called ‘preferRelative’ which tries to resolve these kind of requests in the current director
y too.
@ ./react/features/base/i18n/index.js 5:0-76 5:0-76 5:0-76 5:0-76
@ ./react/features/invite/components/dial-in-info-page/DialInInfoApp.web.js 5:0-45 14:10-17
@ ./react/features/invite/components/dial-in-info-page/index.js 2:0-25

2 errors have detailed information that is not shown.
Use ‘stats.errorDetails: true’ resp. ‘–stats-error-details’ to show it.

webpack 5.57.1 compiled with 138 errors in 87312 ms

asset do_external_connect.min.js 3.66 KiB [compared for emit] [minimized] (name: do_external_connect) 2 related assets
orphan modules 26.5 KiB [orphan] 10 modules
cacheable modules 29.6 KiB
./connection_optimization/do_external_connect.js + 6 modules 25.9 KiB [built] [code generated]
./node_modules/@ hapi/bourne/lib/index.js 2.02 KiB [built] [code generated]
./node_modules/clipboard-copy/index.js 1.62 KiB [built] [code generated]
webpack 5.57.1 compiled successfully in 27575 ms

asset flacEncodeWorker.min.js 3.13 KiB [compared for emit] [minimized] (name: flacEncodeWorker) 1 related asset
orphan modules 1.05 KiB [orphan] 1 module
./react/features/local-recording/recording/flac/flacEncodeWorker.js + 1 modules 10.2 KiB [built] [code generated]
webpack 5.57.1 compiled successfully in 6088 ms

asset analytics-ga.min.js 4.24 KiB [compared for emit] [minimized] (name: analytics-ga) 2 related assets
orphan modules 28.5 KiB [orphan] 10 modules
cacheable modules 32.8 KiB
./react/features/analytics/handlers/GoogleAnalyticsHandler.js + 5 modules 29.2 KiB [built] [code generated]
./node_modules/clipboard-copy/index.js 1.62 KiB [built] [code generated]
./node_modules/@ hapi/bourne/lib/index.js 2.02 KiB [built] [code generated]
webpack 5.57.1 compiled successfully in 34447 ms

asset close3.min.js 0 bytes [compared for emit] [minimized] (name: close3)
./static/close3.js 1 bytes [built] [code generated]
webpack 5.57.1 compiled successfully in 1802 ms

asset external_api.min.js 32.6 KiB [compared for emit] [minimized] (name: external_api) 2 related assets
orphan modules 50.5 KiB [orphan] 18 modules
runtime modules 663 bytes 3 modules
cacheable modules 121 KiB
modules by path ./node_modules/ 36.7 KiB
modules by path ./node_modules/@ jitsi/ 19.1 KiB
./node_modules/@ jitsi/logger/lib/index.js 3.74 KiB [built] [code generated]
./node_modules/@ jitsi/logger/lib/Logger.js 5.41 KiB [built] [code generated]
./node_modules/@ jitsi/logger/lib/LogCollector.js 9.92 KiB [built] [code generated]
./node_modules/events/events.js 14 KiB [built] [code generated]
./node_modules/@ hapi/bourne/lib/index.js 2.02 KiB [built] [code generated]
./node_modules/clipboard-copy/index.js 1.62 KiB [built] [code generated]
modules by path ./modules/API/external/ 84.6 KiB
./modules/API/external/index.js 171 bytes [built] [code generated]
./modules/API/external/external_api.js + 13 modules 84.5 KiB [built] [code generated]
webpack 5.57.1 compiled successfully in 39023 ms

asset facial-expressions-worker.min.js 638 KiB [compared for emit] [minimized] (name: facial-expressions-worker) 2 related assets
orphan modules 840 KiB [orphan] 176 modules
runtime modules 221 bytes 1 module
cacheable modules 845 KiB
modules by path ./react/features/facial-recognition/ 845 KiB
./react/features/facial-recognition/facialExpressionsWorker.js + 175 modules 842 KiB [built] [code generated]
./react/features/facial-recognition/faceApiPatch.js 3.15 KiB [built] [code generated]
optional modules 30 bytes [optional]
crypto (ignored) 15 bytes [optional] [built] [code generated]
fs (ignored) 15 bytes [optional] [built] [code generated]
node-fetch (ignored) 15 bytes [built] [code generated]
util (ignored) 15 bytes [built] [code generated]
webpack 5.57.1 compiled successfully in 61649 ms
Makefile:23: recipe for target ‘compile’ failed
make: *** [compile] Error 1

Node and npm version? Try with 8 and 16.
Delete node_modules before trying with the new versions.

Thanks a lot for your support! I did what you mentioned, switched node version and npm to

node: v16.13.2
npm: 8.1.2

And I got the following error:

11778 silly saveTree │ │ │ └── file-uri-to-path@1.0.0
11778 silly saveTree │ │ └── nan@2.14.2
11778 silly saveTree │ ├─┬ glob-parent@3.1.0
11778 silly saveTree │ │ ├── is-glob@3.1.0
11778 silly saveTree │ │ └── path-dirname@1.0.2
11778 silly saveTree │ ├─┬ is-binary-path@1.0.1
11778 silly saveTree │ │ └── binary-extensions@1.13.1
11778 silly saveTree │ ├── readdirp@2.2.1
11778 silly saveTree │ └── upath@1.2.0
11778 silly saveTree └── webpack-sources@1.4.3
11779 verbose stack Error: exited with error code: 128
11779 verbose stack at ChildProcess. (/usr/local/lib/node_modules/npm/node_modules/pacote/lib/util/finished.js:12:19)
11779 verbose stack at emitTwo (events.js:126:13)
11779 verbose stack at ChildProcess.emit (events.js:214:7)
11779 verbose stack at maybeClose (internal/child_process.js:915:16)
11779 verbose stack at Socket.stream.socket.on (internal/child_process.js:336:11)
11779 verbose stack at emitOne (events.js:116:13)
11779 verbose stack at Socket.emit (events.js:211:7)
11779 verbose stack at Pipe._handle.close [as _onclose] (net.js:561:12)
11780 verbose cwd /home/rasa911216/Programs/Repositories/jitsi-meet
11781 verbose Linux 4.15.0-23-generic
11782 verbose argv “/usr/local/bin/node” “/usr/local/bin/npm” “install” “–prefix” “resources/load-test”
11783 verbose node v8.17.0
11784 verbose npm v6.13.4
11785 error Error while executing:
11785 error /usr/bin/git ls-remote -h -t ssh://git@github.com/jitsi/eslint-config-jitsi.git
11785 error
11785 error Host key verification failed.
11785 error fatal: Could not read from remote repository.
11785 error
11785 error Please make sure you have the correct access rights
11785 error and the repository exists.
11785 error
11785 error exited with error code: 128
11786 verbose exit [ 1, true ]

Still looking for a fix, and posting for document that may be useful to others getting this error.

If it helps others having the same issues, at this point I deleted jitsi-meet and cloned it again. After changing node to 16 and npm to 8 as suggested, the code compiled and gave me the following error:

cp: cannot stat ‘node_modules/lib-jitsi-meet/dist/umd/lib-jitsi-meet.min.map’: No such file or directory
cp: cannot stat ‘node_modules/lib-jitsi-meet/dist/umd/lib-jitsi-meet.e2ee-worker.js’: No such file or directory

I followed these instructions:

and copied the missing files from lib-jitsi-meet to jitsi-meet. After that it compiled and ran, then moved on to step 6 and 7. It had no issues, but when testing the session with the new configuration I’m now getting the error:

Adding the error log here because it didn’t allow it in the same post

Logger.js:154 2022-01-30T06:15:40.397Z [JitsiMeetJS.js] <Object.getGlobalOnErrorHandler>: UnhandledError: Focus error, retry after 1000 Script: null Line: null Column: null StackTrace: Error: Focus error, retry after 1000
at xs._allocateConferenceFocusError (https : / / meet.test/libs/lib-jitsi-meet.min.js?v=139:2:269636)
at https : / / meet.test/libs/lib-jitsi-meet.min.js?v=139:2:268677
at I.Handler.handler (https : / / meet.test/libs/lib-jitsi-meet.min.js?v=139:2:609708)
at I.Handler.run (https : / / meet.test/libs/lib-jitsi-meet.min.js?v=139:2:605007)
at https : / / meet.test/libs/lib-jitsi-meet.min.js?v=139:2:613445
at Object.forEachChild (https : / / meet.test/libs/lib-jitsi-meet.min.js?v=139:2:596675)
at I.Connection._dataRecv (https : / / meet.test/libs/lib-jitsi-meet.min.js?v=139:2:613294)
at M.Bosh._onRequestStateChange (https : / / meet.test/libs/lib-jitsi-meet.min.js?v=139:2:633278)
r Logger.js:154
getGlobalOnErrorHandler JitsiMeetJS.js:530
window.onerror middleware.js:110
callErrorHandler GlobalOnErrorHandler.js:61
xs._allocateConferenceFocusError moderator.js:382
(anonymous) moderator.js:309
(anonymous) strophe.umd.js:2716
run strophe.umd.js:1875
(anonymous) strophe.umd.js:3157
forEachChild strophe.umd.js:830
_dataRecv strophe.umd.js:3146
_onRequestStateChange strophe.umd.js:5012
XMLHttpRequest.send (async)
d strophe.umd.js:5123
_processRequest strophe.umd.js:5137
_throttledRequestHandler strophe.umd.js:5290
_onIdle strophe.umd.js:4901
_onIdle strophe.umd.js:3881
flush strophe.umd.js:2599
flush XmppConnection.js:355
(anonymous) moderator.js:315
xs.allocateConferenceFocus moderator.js:301
(anonymous) ChatRoom.js:190
join ChatRoom.js:183
$c.join JitsiConference.js:577
connect conference.js:419
(anonymous) conference.js:764
startConference conference.js:763
init conference.js:866
await in init (async)
(anonymous) actions.web.js:31
Promise.then (async)
(anonymous) actions.web.js:30
(anonymous) index.js:11
(anonymous) middleware.js:30
(anonymous) middleware.js:38
(anonymous) middleware.web.js:124
_openURL AbstractApp.js:114
componentDidMount AbstractApp.js:49
await in componentDidMount (async)
ms react-dom.production.min.js:219
Pl react-dom.production.min.js:259
t.unstable_runWithPriority scheduler.production.min.js:18
Wr react-dom.production.min.js:122
Tl react-dom.production.min.js:252
gl react-dom.production.min.js:243
dl react-dom.production.min.js:237
Jl react-dom.production.min.js:285
(anonymous) react-dom.production.min.js:289
yl react-dom.production.min.js:244
ac react-dom.production.min.js:289
t.render react-dom.production.min.js:296
_pe.renderEntryPoint index.web.js:54
(anonymous) Test:26
Show 246 more frames
Logger.js:154 2022-01-30T06:15:40.400Z [modules/xmpp/moderator.js] <xs._allocateConferenceFocusError>: Focus error, retry after 1000 <iq xmlns=​"jabber:​client" id=​"7538428b-78e2-491f-9c45-80f5e9dc2b71:​sendIQ" from=​"focus.meet.test" to=​"gp7_x1zwghv25bst meet.test/​RffT86Mw" type=​"error">​…​​
r Logger.js:154
xs._allocateConferenceFocusError moderator.js:383
(anonymous) moderator.js:309
(anonymous) strophe.umd.js:2716
run strophe.umd.js:1875
(anonymous) strophe.umd.js:3157
forEachChild strophe.umd.js:830
_dataRecv strophe.umd.js:3146
_onRequestStateChange strophe.umd.js:5012
XMLHttpRequest.send (async)
d strophe.umd.js:5123
_processRequest strophe.umd.js:5137
_throttledRequestHandler strophe.umd.js:5290
_onIdle strophe.umd.js:4901
_onIdle strophe.umd.js:3881
flush strophe.umd.js:2599
flush XmppConnection.js:355
(anonymous) moderator.js:315
xs.allocateConferenceFocus moderator.js:301
(anonymous) ChatRoom.js:190
join ChatRoom.js:183
$c.join JitsiConference.js:577
connect conference.js:419
(anonymous) conference.js:764
startConference conference.js:763
init conference.js:866
await in init (async)
(anonymous) actions.web.js:31
Promise.then (async)
(anonymous) actions.web.js:30
(anonymous) index.js:11
(anonymous) middleware.js:236
(anonymous) middleware.js:38
(anonymous) middleware.web.js:124
_start Conference.js:372
componentDidMount Conference.js:168
ms react-dom.production.min.js:219
Pl react-dom.production.min.js:259
t.unstable_runWithPriority scheduler.production.min.js:18
Wr react-dom.production.min.js:122
Tl react-dom.production.min.js:252
gl react-dom.production.min.js:243
(anonymous) react-dom.production.min.js:123
t.unstable_runWithPriority scheduler.production.min.js:18
Wr react-dom.production.min.js:122
Kr react-dom.production.min.js:123
Gr react-dom.production.min.js:122
dl react-dom.production.min.js:237
enqueueSetState react-dom.production.min.js:133
g.setState react.production.min.js:12
(anonymous) BaseApp.js:273
_navigate BaseApp.js:272
(anonymous) middleware.js:154
Promise.then (async)
(anonymous) middleware.js:154
(anonymous) middleware.js:38
(anonymous) middleware.web.js:124
_openURL AbstractApp.js:114
componentDidMount AbstractApp.js:49
await in componentDidMount (async)
ms react-dom.production.min.js:219
Pl react-dom.production.min.js:259
t.unstable_runWithPriority scheduler.production.min.js:18
Wr react-dom.production.min.js:122
Tl react-dom.production.min.js:252
gl react-dom.production.min.js:243
dl react-dom.production.min.js:237
Jl react-dom.production.min.js:285
(anonymous) react-dom.production.min.js:289
yl react-dom.production.min.js:244
ac react-dom.production.min.js:289
t.render react-dom.production.min.js:296
_pe.renderEntryPoint index.web.js:54
(anonymous) Test:26
Show 243 more frames
Logger.js:154 2022-01-30T06:15:40.459Z [features/overlay] <Object.componentDidMount>: The conference will be reloaded after 25 seconds.
Logger.js:154 2022-01-30T06:15:40.482Z [conference.js] <Sie._onConferenceFailed>: CONFERENCE FAILED: conference.focusDisconnected focus.meet.test 1
i Logger.js:154
_onConferenceFailed conference.js:309
r.emit events.js:153
r.emit events.js:153
xs._allocateConferenceFocusError moderator.js:393
(anonymous) moderator.js:309
(anonymous) strophe.umd.js:2716
run strophe.umd.js:1875
(anonymous) strophe.umd.js:3157
forEachChild strophe.umd.js:830
_dataRecv strophe.umd.js:3146
_onRequestStateChange strophe.umd.js:5012
XMLHttpRequest.send (async)
d strophe.umd.js:5123
_processRequest strophe.umd.js:5137
_throttledRequestHandler strophe.umd.js:5290
_onIdle strophe.umd.js:4901
_onIdle strophe.umd.js:3881
flush strophe.umd.js:2599
flush XmppConnection.js:355
(anonymous) moderator.js:315
xs.allocateConferenceFocus moderator.js:301
(anonymous) ChatRoom.js:190
join ChatRoom.js:183
$c.join JitsiConference.js:577
connect conference.js:419
(anonymous) conference.js:764
startConference conference.js:763
init conference.js:866
await in init (async)
(anonymous) actions.web.js:31
Promise.then (async)
(anonymous) actions.web.js:30
(anonymous) middleware.web.js:124
_start Conference.js:372
componentDidMount Conference.js:168
ms react-dom.production.min.js:219
Pl react-dom.production.min.js:259
t.unstable_runWithPriority scheduler.production.min.js:18
Wr react-dom.production.min.js:122
Tl react-dom.production.min.js:252
gl react-dom.production.min.js:243
(anonymous) react-dom.production.min.js:123
t.unstable_runWithPriority scheduler.production.min.js:18
Wr react-dom.production.min.js:122
dl react-dom.production.min.js:237
enqueueSetState react-dom.production.min.js:133
g.setState react.production.min.js:12
(anonymous) BaseApp.js:273
_navigate BaseApp.js:272
(anonymous) middleware.js:154
Promise.then (async)
(anonymous) middleware.js:154
(anonymous) middleware.js:38
(anonymous) middleware.web.js:124
_openURL AbstractApp.js:114
componentDidMount AbstractApp.js:49
await in componentDidMount (async)
ms react-dom.production.min.js:219
Pl react-dom.production.min.js:259
t.unstable_runWithPriority scheduler.production.min.js:18
Wr react-dom.production.min.js:122
Jl react-dom.production.min.js:285
(anonymous) react-dom.production.min.js:289
yl react-dom.production.min.js:244
ac react-dom.production.min.js:289
t.render react-dom.production.min.js:296
_pe.renderEntryPoint index.web.js:54
(anonymous) Test:26
Show 246 more frames
Logger.js:154 2022-01-30T06:15:40.509Z [modules/UI/videolayout/LargeVideoManager.js] hover in local
Logger.js:154 2022-01-30T06:15:41.504Z [modules/xmpp/moderator.js] <xs.setFocusUserJid>: Focus jid set to: undefined
Logger.js:154 2022-01-30T06:15:41.506Z [modules/xmpp/moderator.js] <xs.createConferenceIq>: Session ID: null machine UID: d8a43affdf52737c68dc9ede72b1ece8
Logger.js:154 2022-01-30T06:15:41.622Z [JitsiMeetJS.js] <Object.getGlobalOnErrorHandler>: UnhandledError: Focus error, retry after 2000 Script: null Line: null Column: null StackTrace: Error: Focus error, retry after 2000
at xs._allocateConferenceFocusError (https : / / meet.test/libs/lib-jitsi-meet.min.js?v=139:2:269636)
at https : / / meet.test/libs/lib-jitsi-meet.min.js?v=139:2:268677
at I.Handler.handler (https : / / meet.test/libs/lib-jitsi-meet.min.js?v=139:2:609708)
at I.Handler.run (https : / / meet.test/libs/lib-jitsi-meet.min.js?v=139:2:605007)
at https : / / meet.test/libs/lib-jitsi-meet.min.js?v=139:2:613445
at Object.forEachChild (https : / / meet.test/libs/lib-jitsi-meet.min.js?v=139:2:596675)
at I.Connection._dataRecv (https : / / meet.test/libs/lib-jitsi-meet.min.js?v=139:2:613294)
at M.Bosh._onRequestStateChange (https : / / meet.test/libs/lib-jitsi-meet.min.js?v=139:2:633278)
r Logger.js:154
getGlobalOnErrorHandler JitsiMeetJS.js:530
window.onerror middleware.js:110
callErrorHandler GlobalOnErrorHandler.js:61
xs._allocateConferenceFocusError moderator.js:382
(anonymous) moderator.js:309
(anonymous) strophe.umd.js:2716
run strophe.umd.js:1875
(anonymous) strophe.umd.js:3157
forEachChild strophe.umd.js:830
_dataRecv strophe.umd.js:3146
_onRequestStateChange strophe.umd.js:5012
XMLHttpRequest.send (async)
d strophe.umd.js:5123
_processRequest strophe.umd.js:5137
_throttledRequestHandler strophe.umd.js:5290
_onIdle strophe.umd.js:4901
_onIdle strophe.umd.js:3881
(anonymous) strophe.umd.js:3886
setTimeout (async)
_onIdle strophe.umd.js:3885
(anonymous) strophe.umd.js:5257
setTimeout (async)
_send strophe.umd.js:5256
send strophe.umd.js:2583
sendIQ strophe.umd.js:2740
info strophe.disco.js:127
(anonymous) Caps.js:213
_getDiscoInfo Caps.js:212
getFeaturesAndIdentities Caps.js:200
(anonymous) xmpp.js:443
_processDiscoInfoIdentities xmpp.js:417
(anonymous) xmpp.js:306
Promise.then (async)
connectionHandler xmpp.js:300
_stropheConnectionCb XmppConnection.js:308
_changeConnectStatus strophe.umd.js:3011
_onSessionResultIQ strophe.umd.js:3705
run strophe.umd.js:1875
(anonymous) strophe.umd.js:3157
forEachChild strophe.umd.js:830
_dataRecv strophe.umd.js:3146
_onRequestStateChange strophe.umd.js:5012
XMLHttpRequest.send (async)
d strophe.umd.js:5123
_processRequest strophe.umd.js:5137
_throttledRequestHandler strophe.umd.js:5290
_onIdle strophe.umd.js:4901
_onIdle strophe.umd.js:3881
(anonymous) strophe.umd.js:5257
setTimeout (async)
_send strophe.umd.js:5256
send strophe.umd.js:2583
_establishSession strophe.umd.js:3675
_onResourceBindResultIQ strophe.umd.js:3644
run strophe.umd.js:1875
(anonymous) strophe.umd.js:3157
forEachChild strophe.umd.js:830
_dataRecv strophe.umd.js:3146
_onRequestStateChange strophe.umd.js:5012
XMLHttpRequest.send (async)
d strophe.umd.js:5123
_processRequest strophe.umd.js:5137
_throttledRequestHandler strophe.umd.js:5290
_onIdle strophe.umd.js:4901
_onIdle strophe.umd.js:3881
(anonymous) strophe.umd.js:5257
setTimeout (async)
_send strophe.umd.js:5256
send strophe.umd.js:2583
bind strophe.umd.js:3601
_onStreamFeaturesAfterSASL strophe.umd.js:3562
_onStreamFeaturesAfterSASL strophe.stream-management.js:234
r strophe.umd.js:3517
(anonymous) strophe.umd.js:3523
run strophe.umd.js:1875
(anonymous) strophe.umd.js:3157
forEachChild strophe.umd.js:830
_dataRecv strophe.umd.js:3146
_onRequestStateChange strophe.umd.js:5012
XMLHttpRequest.send (async)
d strophe.umd.js:5123
_processRequest strophe.umd.js:5137
_throttledRequestHandler strophe.umd.js:5290
_onIdle strophe.umd.js:4901
_onIdle strophe.umd.js:3881
(anonymous) strophe.umd.js:2769
setTimeout (async)
_sendRestart strophe.umd.js:2768
_sasl_success_cb strophe.umd.js:3529
run strophe.umd.js:1875
(anonymous) strophe.umd.js:3157
forEachChild strophe.umd.js:830
_dataRecv strophe.umd.js:3146
_onRequestStateChange strophe.umd.js:5012
XMLHttpRequest.send (async)
d strophe.umd.js:5123
_processRequest strophe.umd.js:5137
_throttledRequestHandler strophe.umd.js:5290
_onIdle strophe.umd.js:4901
_onIdle strophe.umd.js:3881
(anonymous) strophe.umd.js:5257
setTimeout (async)
_send strophe.umd.js:5256
send strophe.umd.js:2583
_attemptSASLAuth strophe.umd.js:3364
authenticate strophe.umd.js:3319
_connect_cb strophe.umd.js:3271
_onRequestStateChange strophe.umd.js:5012
XMLHttpRequest.send (async)
d strophe.umd.js:5123
_processRequest strophe.umd.js:5137
_throttledRequestHandler strophe.umd.js:5290
_connect strophe.umd.js:4586
connect strophe.umd.js:2368
_interceptConnectArgs strophe.stream-management.js:228
connect XmppConnection.js:264
_connect xmpp.js:536
connect xmpp.js:638
Uc.connect JitsiConnection.js:61
PY connection.js:52
(anonymous) connection.js:196
jY connection.js:121
MY connection.js:226
yie conference.js:213
createInitialLocalTracksAndConnect conference.js:710
init conference.js:862
await in init (async)
(anonymous) actions.web.js:31
Promise.then (async)
(anonymous) actions.web.js:30
dl react-dom.production.min.js:237
Jl react-dom.production.min.js:285
(anonymous) react-dom.production.min.js:289
yl react-dom.production.min.js:244
ac react-dom.production.min.js:289
t.render react-dom.production.min.js:296
_pe.renderEntryPoint index.web.js:54
(anonymous) Test:26
Show 247 more frames
Logger.js:154 2022-01-30T06:15:41.627Z [modules/xmpp/moderator.js] <xs._allocateConferenceFocusError>: Focus error, retry after 2000 <iq xmlns=​"jabber:​client" id=​"41c675d6-2007-4913-8b58-65d53853f6c5:​sendIQ" from=​"focus.meet.test" to=​"gp7_x1zwghv25bst meet.test/​RffT86Mw" type=​"error">​…​​
r Logger.js:154
xs._allocateConferenceFocusError moderator.js:383
(anonymous) moderator.js:309
(anonymous) strophe.umd.js:2716
run strophe.umd.js:1875
(anonymous) strophe.umd.js:3157
forEachChild strophe.umd.js:830
_dataRecv strophe.umd.js:3146
_onRequestStateChange strophe.umd.js:5012
XMLHttpRequest.send (async)
d strophe.umd.js:5123
_processRequest strophe.umd.js:5137
_throttledRequestHandler strophe.umd.js:5290
_onIdle strophe.umd.js:4901
_onIdle strophe.umd.js:3881
(anonymous) strophe.umd.js:3886
setTimeout (async)
_onIdle strophe.umd.js:3885
(anonymous) strophe.umd.js:5257
setTimeout (async)
_send strophe.umd.js:5256
send strophe.umd.js:2583
sendIQ strophe.umd.js:2740
info strophe.disco.js:127
(anonymous) Caps.js:213
_getDiscoInfo Caps.js:212
getFeaturesAndIdentities Caps.js:200
(anonymous) xmpp.js:443
_processDiscoInfoIdentities xmpp.js:417
(anonymous) xmpp.js:306
Promise.then (async)
connectionHandler xmpp.js:300
_stropheConnectionCb XmppConnection.js:308
_changeConnectStatus strophe.umd.js:3011
_onSessionResultIQ strophe.umd.js:3705
run strophe.umd.js:1875
(anonymous) strophe.umd.js:3157
forEachChild strophe.umd.js:830
_dataRecv strophe.umd.js:3146
_onRequestStateChange strophe.umd.js:5012
XMLHttpRequest.send (async)
d strophe.umd.js:5123
_processRequest strophe.umd.js:5137
_throttledRequestHandler strophe.umd.js:5290
_onIdle strophe.umd.js:4901
_onIdle strophe.umd.js:3881
(anonymous) strophe.umd.js:5257
setTimeout (async)
_send strophe.umd.js:5256
send strophe.umd.js:2583
_establishSession strophe.umd.js:3675
_onResourceBindResultIQ strophe.umd.js:3644
run strophe.umd.js:1875
(anonymous) strophe.umd.js:3157
forEachChild strophe.umd.js:830
_dataRecv strophe.umd.js:3146
_onRequestStateChange strophe.umd.js:5012
XMLHttpRequest.send (async)
d strophe.umd.js:5123
_processRequest strophe.umd.js:5137
_throttledRequestHandler strophe.umd.js:5290
_onIdle strophe.umd.js:4901
_onIdle strophe.umd.js:3881
(anonymous) strophe.umd.js:5257
setTimeout (async)
_send strophe.umd.js:5256
send strophe.umd.js:2583
bind strophe.umd.js:3601
_onStreamFeaturesAfterSASL strophe.umd.js:3562
_onStreamFeaturesAfterSASL strophe.stream-management.js:234
r strophe.umd.js:3517
(anonymous) strophe.umd.js:3523
run strophe.umd.js:1875
(anonymous) strophe.umd.js:3157
forEachChild strophe.umd.js:830
_dataRecv strophe.umd.js:3146
_onRequestStateChange strophe.umd.js:5012
XMLHttpRequest.send (async)
d strophe.umd.js:5123
_processRequest strophe.umd.js:5137
_throttledRequestHandler strophe.umd.js:5290
_onIdle strophe.umd.js:4901
_onIdle strophe.umd.js:3881
(anonymous) strophe.umd.js:2769
setTimeout (async)
_sendRestart strophe.umd.js:2768
_sasl_success_cb strophe.umd.js:3529
run strophe.umd.js:1875
(anonymous) strophe.umd.js:3157
forEachChild strophe.umd.js:830
_dataRecv strophe.umd.js:3146
_onRequestStateChange strophe.umd.js:5012
XMLHttpRequest.send (async)
d strophe.umd.js:5123
_processRequest strophe.umd.js:5137
_throttledRequestHandler strophe.umd.js:5290
_onIdle strophe.umd.js:4901
_onIdle strophe.umd.js:3881
(anonymous) strophe.umd.js:5257
setTimeout (async)
_send strophe.umd.js:5256
send strophe.umd.js:2583
_attemptSASLAuth strophe.umd.js:3364
authenticate strophe.umd.js:3319
_connect_cb strophe.umd.js:3271
_onRequestStateChange strophe.umd.js:5012
XMLHttpRequest.send (async)
d strophe.umd.js:5123
_processRequest strophe.umd.js:5137
_throttledRequestHandler strophe.umd.js:5290
_connect strophe.umd.js:4586
connect strophe.umd.js:2368
_interceptConnectArgs strophe.stream-management.js:228
connect XmppConnection.js:264
_connect xmpp.js:536
connect xmpp.js:638
Uc.connect JitsiConnection.js:61
PY connection.js:52
(anonymous) connection.js:196
jY connection.js:121
MY connection.js:226
yie conference.js:213
createInitialLocalTracksAndConnect conference.js:710
init conference.js:862
await in init (async)
(anonymous) actions.web.js:31
Promise.then (async)
(anonymous) actions.web.js:30
(anonymous) Test:26
Show 247 more frames
Logger.js:154 2022-01-30T06:15:41.653Z [conference.js] <Sie._onConferenceFailed>: CONFERENCE FAILED: conference.focusDisconnected focus.meet.test 2
i Logger.js:154
_onConferenceFailed conference.js:309
r.emit events.js:153
r.emit events.js:153
xs._allocateConferenceFocusError moderator.js:393
(anonymous) moderator.js:309
(anonymous) strophe.umd.js:2716
run strophe.umd.js:1875
(anonymous) strophe.umd.js:3157
forEachChild strophe.umd.js:830
_dataRecv strophe.umd.js:3146
_onRequestStateChange strophe.umd.js:5012
XMLHttpRequest.send (async)
d strophe.umd.js:5123
_processRequest strophe.umd.js:5137
_throttledRequestHandler strophe.umd.js:5290
_onIdle strophe.umd.js:4901
_onIdle strophe.umd.js:3881
(anonymous) strophe.umd.js:3886
setTimeout (async)
_onIdle strophe.umd.js:3885
(anonymous) strophe.umd.js:5257
setTimeout (async)
_send strophe.umd.js:5256
send strophe.umd.js:2583
sendIQ strophe.umd.js:2740
info strophe.disco.js:127
(anonymous) Caps.js:213
_getDiscoInfo Caps.js:212
getFeaturesAndIdentities Caps.js:200
(anonymous) xmpp.js:443
_processDiscoInfoIdentities xmpp.js:417
(anonymous) xmpp.js:306
Promise.then (async)
connectionHandler xmpp.js:300
_stropheConnectionCb XmppConnection.js:308
_changeConnectStatus strophe.umd.js:3011
_onSessionResultIQ strophe.umd.js:3705
run strophe.umd.js:1875
(anonymous) strophe.umd.js:3157
forEachChild strophe.umd.js:830
_dataRecv strophe.umd.js:3146
_onRequestStateChange strophe.umd.js:5012
XMLHttpRequest.send (async)
d strophe.umd.js:5123
_processRequest strophe.umd.js:5137
_throttledRequestHandler strophe.umd.js:5290
_onIdle strophe.umd.js:4901
_onIdle strophe.umd.js:3881
(anonymous) strophe.umd.js:5257
setTimeout (async)
_send strophe.umd.js:5256
send strophe.umd.js:2583
_establishSession strophe.umd.js:3675
_onResourceBindResultIQ strophe.umd.js:3644
run strophe.umd.js:1875
(anonymous) strophe.umd.js:3157
forEachChild strophe.umd.js:830
_dataRecv strophe.umd.js:3146
_onRequestStateChange strophe.umd.js:5012
XMLHttpRequest.send (async)
d strophe.umd.js:5123
_processRequest strophe.umd.js:5137
_throttledRequestHandler strophe.umd.js:5290
_onIdle strophe.umd.js:4901
_onIdle strophe.umd.js:3881
(anonymous) strophe.umd.js:5257
setTimeout (async)
_send strophe.umd.js:5256
send strophe.umd.js:2583
bind strophe.umd.js:3601
_onStreamFeaturesAfterSASL strophe.umd.js:3562
_onStreamFeaturesAfterSASL strophe.stream-management.js:234
r strophe.umd.js:3517
(anonymous) strophe.umd.js:3523
run strophe.umd.js:1875
(anonymous) strophe.umd.js:3157
forEachChild strophe.umd.js:830
_dataRecv strophe.umd.js:3146
_onRequestStateChange strophe.umd.js:5012
XMLHttpRequest.send (async)
d strophe.umd.js:5123
_processRequest strophe.umd.js:5137
_throttledRequestHandler strophe.umd.js:5290
_onIdle strophe.umd.js:4901
_onIdle strophe.umd.js:3881
(anonymous) strophe.umd.js:2769
setTimeout (async)
_sendRestart strophe.umd.js:2768
_sasl_success_cb strophe.umd.js:3529
run strophe.umd.js:1875
(anonymous) strophe.umd.js:3157
forEachChild strophe.umd.js:830
_dataRecv strophe.umd.js:3146
_onRequestStateChange strophe.umd.js:5012
XMLHttpRequest.send (async)
d strophe.umd.js:5123
_processRequest strophe.umd.js:5137
_throttledRequestHandler strophe.umd.js:5290
_onIdle strophe.umd.js:4901
_onIdle strophe.umd.js:3881
(anonymous) strophe.umd.js:5257
setTimeout (async)
_send strophe.umd.js:5256
send strophe.umd.js:2583
_attemptSASLAuth strophe.umd.js:3364
authenticate strophe.umd.js:3319
_connect_cb strophe.umd.js:3271
_onRequestStateChange strophe.umd.js:5012
XMLHttpRequest.send (async)
d strophe.umd.js:5123
_processRequest strophe.umd.js:5137
_throttledRequestHandler strophe.umd.js:5290
_connect strophe.umd.js:4586
connect strophe.umd.js:2368
_interceptConnectArgs strophe.stream-management.js:228
connect XmppConnection.js:264
_connect xmpp.js:536
connect xmpp.js:638
Uc.connect JitsiConnection.js:61
PY connection.js:52
(anonymous) connection.js:196
jY connection.js:121
MY connection.js:226
yie conference.js:213
createInitialLocalTracksAndConnect conference.js:710
init conference.js:862
await in init (async)
(anonymous) actions.web.js:31
Promise.then (async)
(anonymous) actions.web.js:30
ac react-dom.production.min.js:289
t.render react-dom.production.min.js:296
_pe.renderEntryPoint index.web.js:54
(anonymous) Test:26
Show 247 more frames
Logger.js:154 2022-01-30T06:15:43.662Z [modules/xmpp/moderator.js] <xs.setFocusUserJid>: Focus jid set to: undefined
Logger.js:154 2022-01-30T06:15:43.663Z [modules/xmpp/moderator.js] <xs.createConferenceIq>: Session ID: null machine UID: d8a43affdf52737c68dc9ede72b1ece8
Logger.js:154 2022-01-30T06:15:43.752Z [JitsiMeetJS.js] <Object.getGlobalOnErrorHandler>: UnhandledError: Focus error, retry after 4000 Script: null Line: null Column: null StackTrace: Error: Focus error, retry after 4000
at xs._allocateConferenceFocusError (https : / / meet.test/libs/lib-jitsi-meet.min.js?v=139:2:269636)
at https : / / meet.test/libs/lib-jitsi-meet.min.js?v=139:2:268677
at I.Handler.handler (https : / / meet.test/libs/lib-jitsi-meet.min.js?v=139:2:609708)
at I.Handler.run (https : / / meet.test/libs/lib-jitsi-meet.min.js?v=139:2:605007)
at https : / / meet.test/libs/lib-jitsi-meet.min.js?v=139:2:613445
at Object.forEachChild (https : / / meet.test/libs/lib-jitsi-meet.min.js?v=139:2:596675)
at I.Connection._dataRecv (https : / / meet.test/libs/lib-jitsi-meet.min.js?v=139:2:613294)
at M.Bosh._onRequestStateChange (https : / / meet.test/libs/lib-jitsi-meet.min.js?v=139:2:633278)
r Logger.js:154
getGlobalOnErrorHandler JitsiMeetJS.js:530
window.onerror middleware.js:110
callErrorHandler GlobalOnErrorHandler.js:61
xs._allocateConferenceFocusError moderator.js:382
(anonymous) moderator.js:309
(anonymous) strophe.umd.js:2716
run strophe.umd.js:1875
(anonymous) strophe.umd.js:3157
forEachChild strophe.umd.js:830
_dataRecv strophe.umd.js:3146
_onRequestStateChange strophe.umd.js:5012
XMLHttpRequest.send (async)
d strophe.umd.js:5123
_processRequest strophe.umd.js:5137
_throttledRequestHandler strophe.umd.js:5294
_onIdle strophe.umd.js:4901
_onIdle strophe.umd.js:3881
flush strophe.umd.js:2599
flush XmppConnection.js:355
(anonymous) moderator.js:315
xs.allocateConferenceFocus moderator.js:301
(anonymous) moderator.js:402
setTimeout (async)
xs._allocateConferenceFocusError moderator.js:401
(anonymous) moderator.js:309
(anonymous) strophe.umd.js:2716
run strophe.umd.js:1875
(anonymous) strophe.umd.js:3157
forEachChild strophe.umd.js:830
_dataRecv strophe.umd.js:3146
_onRequestStateChange strophe.umd.js:5012
XMLHttpRequest.send (async)
d strophe.umd.js:5123
_processRequest strophe.umd.js:5137
_throttledRequestHandler strophe.umd.js:5290
_onIdle strophe.umd.js:4901
_onIdle strophe.umd.js:3881
flush strophe.umd.js:2599
flush XmppConnection.js:355
(anonymous) moderator.js:315
xs.allocateConferenceFocus moderator.js:301
(anonymous) ChatRoom.js:190
join ChatRoom.js:183
$c.join JitsiConference.js:577
connect conference.js:419
(anonymous) conference.js:764
startConference conference.js:763
init conference.js:866
await in init (async)
(anonymous) actions.web.js:31
Promise.then (async)
(anonymous) actions.web.js:30
dl react-dom.production.min.js:237
Jl react-dom.production.min.js:285
(anonymous) react-dom.production.min.js:289
yl react-dom.production.min.js:244
ac react-dom.production.min.js:289
t.render react-dom.production.min.js:296
_pe.renderEntryPoint index.web.js:54
(anonymous) Test:26
Show 247 more frames
Logger.js:154 2022-01-30T06:15:43.755Z [modules/xmpp/moderator.js] <xs._allocateConferenceFocusError>: Focus error, retry after 4000 <iq xmlns=​"jabber:​client" id=​"fc74a8ce-dea7-4e54-a6f4-9656c25b12ff:​sendIQ" from=​"focus.meet.test" to=​"gp7_x1zwghv25bst meet.test/​RffT86Mw" type=​"error">​…​​
r Logger.js:154
xs._allocateConferenceFocusError moderator.js:383
(anonymous) moderator.js:309
(anonymous) strophe.umd.js:2716
run strophe.umd.js:1875
(anonymous) strophe.umd.js:3157
forEachChild strophe.umd.js:830
_dataRecv strophe.umd.js:3146
_onRequestStateChange strophe.umd.js:5012
XMLHttpRequest.send (async)
d strophe.umd.js:5123
_processRequest strophe.umd.js:5137
_throttledRequestHandler strophe.umd.js:5294
_onIdle strophe.umd.js:4901
_onIdle strophe.umd.js:3881
flush strophe.umd.js:2599
flush XmppConnection.js:355
(anonymous) moderator.js:315
xs.allocateConferenceFocus moderator.js:301
(anonymous) moderator.js:402
setTimeout (async)
xs._allocateConferenceFocusError moderator.js:401
(anonymous) moderator.js:309
(anonymous) strophe.umd.js:2716
run strophe.umd.js:1875
(anonymous) strophe.umd.js:3157
forEachChild strophe.umd.js:830
_dataRecv strophe.umd.js:3146
_onRequestStateChange strophe.umd.js:5012
XMLHttpRequest.send (async)
d strophe.umd.js:5123
_processRequest strophe.umd.js:5137
_throttledRequestHandler strophe.umd.js:5290
_onIdle strophe.umd.js:4901
_onIdle strophe.umd.js:3881
flush strophe.umd.js:2599
flush XmppConnection.js:355
(anonymous) moderator.js:315
xs.allocateConferenceFocus moderator.js:301
(anonymous) ChatRoom.js:190
join ChatRoom.js:183
$c.join JitsiConference.js:577
connect conference.js:419
(anonymous) conference.js:764
startConference conference.js:763
init conference.js:866
await in init (async)
(anonymous) actions.web.js:31
Promise.then (async)
(anonymous) actions.web.js:30
Jl react-dom.production.min.js:285
(anonymous) react-dom.production.min.js:289
yl react-dom.production.min.js:244
ac react-dom.production.min.js:289
t.render react-dom.production.min.js:296
_pe.renderEntryPoint index.web.js:54
(anonymous) Test:26
Show 247 more frames
Logger.js:154 2022-01-30T06:15:43.779Z [conference.js] <Sie._onConferenceFailed>: CONFERENCE FAILED: conference.focusDisconnected focus.meet.test 4
i Logger.js:154
_onConferenceFailed conference.js:309
r.emit events.js:153
r.emit events.js:153
xs._allocateConferenceFocusError moderator.js:393
(anonymous) moderator.js:309
(anonymous) strophe.umd.js:2716
run strophe.umd.js:1875
(anonymous) strophe.umd.js:3157
forEachChild strophe.umd.js:830
_dataRecv strophe.umd.js:3146
_onRequestStateChange strophe.umd.js:5012
XMLHttpRequest.send (async)
d strophe.umd.js:5123
_processRequest strophe.umd.js:5137
_throttledRequestHandler strophe.umd.js:5294
_onIdle strophe.umd.js:4901
_onIdle strophe.umd.js:3881
flush strophe.umd.js:2599
flush XmppConnection.js:355
(anonymous) moderator.js:315
xs.allocateConferenceFocus moderator.js:301
(anonymous) moderator.js:402
setTimeout (async)
xs._allocateConferenceFocusError moderator.js:401
(anonymous) moderator.js:309
(anonymous) strophe.umd.js:2716
run strophe.umd.js:1875
(anonymous) strophe.umd.js:3157
forEachChild strophe.umd.js:830
_dataRecv strophe.umd.js:3146
_onRequestStateChange strophe.umd.js:5012
XMLHttpRequest.send (async)
d strophe.umd.js:5123
_processRequest strophe.umd.js:5137
_throttledRequestHandler strophe.umd.js:5290
_onIdle strophe.umd.js:4901
_onIdle strophe.umd.js:3881
flush strophe.umd.js:2599
flush XmppConnection.js:355
(anonymous) moderator.js:315
xs.allocateConferenceFocus moderator.js:301
(anonymous) ChatRoom.js:190
join ChatRoom.js:183
$c.join JitsiConference.js:577
connect conference.js:419
(anonymous) conference.js:764
startConference conference.js:763
init conference.js:866
await in init (async)
(anonymous) actions.web.js:31
Promise.then (async)
(anonymous) actions.web.js:30
Jl react-dom.production.min.js:285
(anonymous) react-dom.production.min.js:289
yl react-dom.production.min.js:244
ac react-dom.production.min.js:289
t.render react-dom.production.min.js:296
_pe.renderEntryPoint index.web.js:54
(anonymous) Test:26
Show 247 more frames
Logger.js:154 2022-01-30T06:15:47.787Z [modules/xmpp/moderator.js] <xs.setFocusUserJid>: Focus jid set to: undefined
Logger.js:154 2022-01-30T06:15:47.787Z [modules/xmpp/moderator.js] <xs.createConferenceIq>: Session ID: null machine UID: d8a43affdf52737c68dc9ede72b1ece8
Logger.js:154 2022-01-30T06:15:47.880Z [JitsiMeetJS.js] <Object.getGlobalOnErrorHandler>: UnhandledError: Focus error, retry after 8000 Script: null Line: null Column: null StackTrace: Error: Focus error, retry after 8000
at xs._allocateConferenceFocusError (https : / / meet.test/libs/lib-jitsi-meet.min.js?v=139:2:269636)
at https : / / meet.test/libs/lib-jitsi-meet.min.js?v=139:2:268677
at I.Handler.handler (https : / / meet.test/libs/lib-jitsi-meet.min.js?v=139:2:609708)
at I.Handler.run (https : / / meet.test/libs/lib-jitsi-meet.min.js?v=139:2:605007)
at https : / / meet.test/libs/lib-jitsi-meet.min.js?v=139:2:613445
at Object.forEachChild (https : / / meet.test/libs/lib-jitsi-meet.min.js?v=139:2:596675)
at I.Connection._dataRecv (https : / / meet.test/libs/lib-jitsi-meet.min.js?v=139:2:613294)
at M.Bosh._onRequestStateChange (https : / / meet.test/libs/lib-jitsi-meet.min.js?v=139:2:633278)
r Logger.js:154
getGlobalOnErrorHandler JitsiMeetJS.js:530
window.onerror middleware.js:110
callErrorHandler GlobalOnErrorHandler.js:61
xs._allocateConferenceFocusError moderator.js:382
(anonymous) moderator.js:309
(anonymous) strophe.umd.js:2716
run strophe.umd.js:1875
(anonymous) strophe.umd.js:3157
forEachChild strophe.umd.js:830
_dataRecv strophe.umd.js:3146
_onRequestStateChange strophe.umd.js:5012
XMLHttpRequest.send (async)
d strophe.umd.js:5123
_processRequest strophe.umd.js:5137
_throttledRequestHandler strophe.umd.js:5294
_onIdle strophe.umd.js:4901
_onIdle strophe.umd.js:3881
flush strophe.umd.js:2599
flush XmppConnection.js:355
(anonymous) moderator.js:315
xs.allocateConferenceFocus moderator.js:301
(anonymous) moderator.js:402
setTimeout (async)
xs._allocateConferenceFocusError moderator.js:401
(anonymous) moderator.js:309
(anonymous) strophe.umd.js:2716
run strophe.umd.js:1875
(anonymous) strophe.umd.js:3157
forEachChild strophe.umd.js:830
_dataRecv strophe.umd.js:3146
_onRequestStateChange strophe.umd.js:5012
XMLHttpRequest.send (async)
d strophe.umd.js:5123
_processRequest strophe.umd.js:5137
_throttledRequestHandler strophe.umd.js:5290
_onIdle strophe.umd.js:4901
_onIdle strophe.umd.js:3881
(anonymous) strophe.umd.js:3886
setTimeout (async)
_onIdle strophe.umd.js:3885
(anonymous) strophe.umd.js:5257
setTimeout (async)
_send strophe.umd.js:5256
send strophe.umd.js:2583
sendIQ strophe.umd.js:2740
info strophe.disco.js:127
(anonymous) Caps.js:213
_getDiscoInfo Caps.js:212
getFeaturesAndIdentities Caps.js:200
(anonymous) xmpp.js:443
_processDiscoInfoIdentities xmpp.js:417
(anonymous) xmpp.js:306
Promise.then (async)
connectionHandler xmpp.js:300
_stropheConnectionCb XmppConnection.js:308
_changeConnectStatus strophe.umd.js:3011
_onSessionResultIQ strophe.umd.js:3705
run strophe.umd.js:1875
(anonymous) strophe.umd.js:3157
forEachChild strophe.umd.js:830
_dataRecv strophe.umd.js:3146
_onRequestStateChange strophe.umd.js:5012
XMLHttpRequest.send (async)
d strophe.umd.js:5123
_processRequest strophe.umd.js:5137
_throttledRequestHandler strophe.umd.js:5290
_onIdle strophe.umd.js:4901
_onIdle strophe.umd.js:3881
(anonymous) strophe.umd.js:5257
setTimeout (async)
_send strophe.umd.js:5256
send strophe.umd.js:2583
_establishSession strophe.umd.js:3675
_onResourceBindResultIQ strophe.umd.js:3644
run strophe.umd.js:1875
(anonymous) strophe.umd.js:3157
forEachChild strophe.umd.js:830
_dataRecv strophe.umd.js:3146
_onRequestStateChange strophe.umd.js:5012
XMLHttpRequest.send (async)
d strophe.umd.js:5123
_processRequest strophe.umd.js:5137
_throttledRequestHandler strophe.umd.js:5290
_onIdle strophe.umd.js:4901
_onIdle strophe.umd.js:3881
(anonymous) strophe.umd.js:5257
setTimeout (async)
_send strophe.umd.js:5256
send strophe.umd.js:2583
bind strophe.umd.js:3601
_onStreamFeaturesAfterSASL strophe.umd.js:3562
_onStreamFeaturesAfterSASL strophe.stream-management.js:234
r strophe.umd.js:3517
(anonymous) strophe.umd.js:3523
run strophe.umd.js:1875
(anonymous) strophe.umd.js:3157
forEachChild strophe.umd.js:830
_dataRecv strophe.umd.js:3146
_onRequestStateChange strophe.umd.js:5012
XMLHttpRequest.send (async)
d strophe.umd.js:5123
_processRequest strophe.umd.js:5137
_throttledRequestHandler strophe.umd.js:5290
_onIdle strophe.umd.js:4901
_onIdle strophe.umd.js:3881
(anonymous) strophe.umd.js:2769
setTimeout (async)
_sendRestart strophe.umd.js:2768
_sasl_success_cb strophe.umd.js:3529
run strophe.umd.js:1875
(anonymous) strophe.umd.js:3157
forEachChild strophe.umd.js:830
_dataRecv strophe.umd.js:3146
_onRequestStateChange strophe.umd.js:5012
XMLHttpRequest.send (async)
d strophe.umd.js:5123
_processRequest strophe.umd.js:5137
_throttledRequestHandler strophe.umd.js:5290
_onIdle strophe.umd.js:4901
_onIdle strophe.umd.js:3881
(anonymous) strophe.umd.js:5257
setTimeout (async)
_send strophe.umd.js:5256
send strophe.umd.js:2583
_attemptSASLAuth strophe.umd.js:3364
authenticate strophe.umd.js:3319
_connect_cb strophe.umd.js:3271
_onRequestStateChange strophe.umd.js:5012
XMLHttpRequest.send (async)
d strophe.umd.js:5123
_processRequest strophe.umd.js:5137
_throttledRequestHandler strophe.umd.js:5290
_connect strophe.umd.js:4586
connect strophe.umd.js:2368
_interceptConnectArgs strophe.stream-management.js:228
connect XmppConnection.js:264
_connect xmpp.js:536
connect xmpp.js:638
Uc.connect JitsiConnection.js:61
PY connection.js:52
(anonymous) connection.js:196
jY connection.js:121
MY connection.js:226
yie conference.js:213
createInitialLocalTracksAndConnect conference.js:710
init conference.js:862
await in init (async)
(anonymous) actions.web.js:31
Promise.then (async)
(anonymous) actions.web.js:30
(anonymous) index.js:11
(anonymous) middleware.js:30
yl react-dom.production.min.js:244
ac react-dom.production.min.js:289
t.render react-dom.production.min.js:296
_pe.renderEntryPoint index.web.js:54
(anonymous) Test:26
Show 247 more frames
Logger.js:154 2022-01-30T06:15:47.886Z [modules/xmpp/moderator.js] <xs._allocateConferenceFocusError>: Focus error, retry after 8000 <iq xmlns=​"jabber:​client" id=​"88bfc157-a80e-41f9-8add-20002fdaf83c:​sendIQ" from=​"focus.meet.test" to=​"gp7_x1zwghv25bst meet.test/​RffT86Mw" type=​"error">​…​​

So it seems I fixed it now, for some reason I just had to implement:

sudo systemctl restart prosody.service
sudo systemctl restart jicofo.service
sudo systemctl restart jitsi-videobridge2.service

Not sure if some change hadn’t been applied yet but after running this, the project works! And now I can hold meetings, thanks a lot to everyone and hope this is useful to new members trying to install the application for development.

Thanks for taking the time to give a detailed outline of your journey. I’m sure some other people in the community will find this useful. :+1:t5:

1 Like