[jitsi-dev] [jitsi-cc] jitsi - Build # 4887 - Still Failing!


#1

Does anyone have an idea how to fix TestOperationSetMultiUserChat2?
It's often failing and it appears to me that most of the time there
have been no changes related to multi-user chat whatsoever.

···

2013/11/1 Jitsi Jenkins <jenkins@jitsi.org>:

jitsi - Build # 4887 - Still Failing

Started by user lyubomir

10 tests failed.
FAILED: net.java.sip.communicator.slick.protocol.jabber.TestOperationSetMultiUserChat2.TestOperationSetMultiUserChat2.testInitialParticipantsRoles

Error Message:
Failed to join room lmuctestroom9@conference.jit.si with nickname: jitsi2@jit.si

Stack Trace:
net.java.sip.communicator.service.protocol.OperationFailedException: Failed to join room lmuctestroom9@conference.jit.si with nickname: jitsi2@jit.si
        at net.java.sip.communicator.impl.protocol.jabber.ChatRoomJabberImpl.joinAs(ChatRoomJabberImpl.java:675)
        at net.java.sip.communicator.impl.protocol.jabber.ChatRoomJabberImpl.joinAs(ChatRoomJabberImpl.java:708)
        at net.java.sip.communicator.impl.protocol.jabber.ChatRoomJabberImpl.join(ChatRoomJabberImpl.java:557)
        at net.java.sip.communicator.slick.protocol.jabber.TestOperationSetMultiUserChat2.testInitialParticipantsRoles(TestOperationSetMultiUserChat2.java:1297)
        at sun.reflect.NativeMethodAccessorImpl.invoke0(Native Method)
        at sun.reflect.NativeMethodAccessorImpl.invoke(NativeMethodAccessorImpl.java:57)
        at sun.reflect.DelegatingMethodAccessorImpl.invoke(DelegatingMethodAccessorImpl.java:43)
        at java.lang.reflect.Method.invoke(Method.java:616)
        at junit.framework.TestCase.runTest(TestCase.java:154)
        at junit.framework.TestCase.runBare(TestCase.java:127)
        at junit.framework.TestResult$1.protect(TestResult.java:106)
        at junit.framework.TestResult.runProtected(TestResult.java:124)
        at junit.framework.TestResult.run(TestResult.java:109)
        at junit.framework.TestCase.run(TestCase.java:118)
        at junit.framework.TestSuite.runTest(TestSuite.java:208)
        at junit.framework.TestSuite.run(TestSuite.java:203)
        at junit.framework.TestSuite.runTest(TestSuite.java:208)
        at junit.framework.TestSuite.run(TestSuite.java:203)
        at net.java.sip.communicator.slick.runner.ScTestRunner.doRun(ScTestRunner.java:108)
        at net.java.sip.communicator.slick.runner.ScTestRunner.doRun(ScTestRunner.java:98)
        at net.java.sip.communicator.slick.runner.ScTestRunner.run(ScTestRunner.java:56)
        at net.java.sip.communicator.slick.runner.SipCommunicatorSlickRunner.start(SipCommunicatorSlickRunner.java:151)
        at org.apache.felix.framework.util.SecureAction.startActivator(SecureAction.java:629)
        at org.apache.felix.framework.Felix.activateBundle(Felix.java:1904)
        at org.apache.felix.framework.Felix.startBundle(Felix.java:1822)
        at org.apache.felix.framework.Felix.setActiveStartLevel(Felix.java:1192)
        at org.apache.felix.framework.StartLevelImpl.run(StartLevelImpl.java:266)
        at java.lang.Thread.run(Thread.java:679)
Caused by: recipient-unavailable(404)
        at org.jivesoftware.smackx.muc.MultiUserChat.join(MultiUserChat.java:504)
        at org.jivesoftware.smackx.muc.MultiUserChat.join(MultiUserChat.java:395)
        at net.java.sip.communicator.impl.protocol.jabber.ChatRoomJabberImpl.joinAs(ChatRoomJabberImpl.java:595)
        ... 27 more

FAILED: net.java.sip.communicator.slick.protocol.jabber.TestOperationSetMultiUserChat2.TestOperationSetMultiUserChat2.testGrantModerator

Error Message:
Wrong count of collected events on user1's side expected:<1> but was:<0>

Stack Trace:
junit.framework.AssertionFailedError: Wrong count of collected events on user1's side expected:<1> but was:<0>
        at junit.framework.Assert.fail(Assert.java:47)
        at junit.framework.Assert.failNotEquals(Assert.java:282)
        at junit.framework.Assert.assertEquals(Assert.java:64)
        at junit.framework.Assert.assertEquals(Assert.java:201)
        at net.java.sip.communicator.slick.protocol.jabber.TestOperationSetMultiUserChat2.testGrantModerator(TestOperationSetMultiUserChat2.java:1468)
        at sun.reflect.NativeMethodAccessorImpl.invoke0(Native Method)
        at sun.reflect.NativeMethodAccessorImpl.invoke(NativeMethodAccessorImpl.java:57)
        at sun.reflect.DelegatingMethodAccessorImpl.invoke(DelegatingMethodAccessorImpl.java:43)
        at java.lang.reflect.Method.invoke(Method.java:616)
        at junit.framework.TestCase.runTest(TestCase.java:154)
        at junit.framework.TestCase.runBare(TestCase.java:127)
        at junit.framework.TestResult$1.protect(TestResult.java:106)
        at junit.framework.TestResult.runProtected(TestResult.java:124)
        at junit.framework.TestResult.run(TestResult.java:109)
        at junit.framework.TestCase.run(TestCase.java:118)
        at junit.framework.TestSuite.runTest(TestSuite.java:208)
        at junit.framework.TestSuite.run(TestSuite.java:203)
        at junit.framework.TestSuite.runTest(TestSuite.java:208)
        at junit.framework.TestSuite.run(TestSuite.java:203)
        at net.java.sip.communicator.slick.runner.ScTestRunner.doRun(ScTestRunner.java:108)
        at net.java.sip.communicator.slick.runner.ScTestRunner.doRun(ScTestRunner.java:98)
        at net.java.sip.communicator.slick.runner.ScTestRunner.run(ScTestRunner.java:56)
        at net.java.sip.communicator.slick.runner.SipCommunicatorSlickRunner.start(SipCommunicatorSlickRunner.java:151)
        at org.apache.felix.framework.util.SecureAction.startActivator(SecureAction.java:629)
        at org.apache.felix.framework.Felix.activateBundle(Felix.java:1904)
        at org.apache.felix.framework.Felix.startBundle(Felix.java:1822)
        at org.apache.felix.framework.Felix.setActiveStartLevel(Felix.java:1192)
        at org.apache.felix.framework.StartLevelImpl.run(StartLevelImpl.java:266)
        at java.lang.Thread.run(Thread.java:679)

FAILED: net.java.sip.communicator.slick.protocol.jabber.TestOperationSetMultiUserChat2.TestOperationSetMultiUserChat2.testRevokeVoice

Error Message:
Wrong count of collected events on user1's side expected:<1> but was:<0>

Stack Trace:
junit.framework.AssertionFailedError: Wrong count of collected events on user1's side expected:<1> but was:<0>
        at junit.framework.Assert.fail(Assert.java:47)
        at junit.framework.Assert.failNotEquals(Assert.java:282)
        at junit.framework.Assert.assertEquals(Assert.java:64)
        at junit.framework.Assert.assertEquals(Assert.java:201)
        at net.java.sip.communicator.slick.protocol.jabber.TestOperationSetMultiUserChat2.testRevokeVoice(TestOperationSetMultiUserChat2.java:1540)
        at sun.reflect.NativeMethodAccessorImpl.invoke0(Native Method)
        at sun.reflect.NativeMethodAccessorImpl.invoke(NativeMethodAccessorImpl.java:57)
        at sun.reflect.DelegatingMethodAccessorImpl.invoke(DelegatingMethodAccessorImpl.java:43)
        at java.lang.reflect.Method.invoke(Method.java:616)
        at junit.framework.TestCase.runTest(TestCase.java:154)
        at junit.framework.TestCase.runBare(TestCase.java:127)
        at junit.framework.TestResult$1.protect(TestResult.java:106)
        at junit.framework.TestResult.runProtected(TestResult.java:124)
        at junit.framework.TestResult.run(TestResult.java:109)
        at junit.framework.TestCase.run(TestCase.java:118)
        at junit.framework.TestSuite.runTest(TestSuite.java:208)
        at junit.framework.TestSuite.run(TestSuite.java:203)
        at junit.framework.TestSuite.runTest(TestSuite.java:208)
        at junit.framework.TestSuite.run(TestSuite.java:203)
        at net.java.sip.communicator.slick.runner.ScTestRunner.doRun(ScTestRunner.java:108)
        at net.java.sip.communicator.slick.runner.ScTestRunner.doRun(ScTestRunner.java:98)
        at net.java.sip.communicator.slick.runner.ScTestRunner.run(ScTestRunner.java:56)
        at net.java.sip.communicator.slick.runner.SipCommunicatorSlickRunner.start(SipCommunicatorSlickRunner.java:151)
        at org.apache.felix.framework.util.SecureAction.startActivator(SecureAction.java:629)
        at org.apache.felix.framework.Felix.activateBundle(Felix.java:1904)
        at org.apache.felix.framework.Felix.startBundle(Felix.java:1822)
        at org.apache.felix.framework.Felix.setActiveStartLevel(Felix.java:1192)
        at org.apache.felix.framework.StartLevelImpl.run(StartLevelImpl.java:266)
        at java.lang.Thread.run(Thread.java:679)

FAILED: net.java.sip.communicator.slick.protocol.jabber.TestOperationSetMultiUserChat2.TestOperationSetMultiUserChat2.testGrantVoice

Error Message:
Wrong count of collected events on user1's side expected:<1> but was:<0>

Stack Trace:
junit.framework.AssertionFailedError: Wrong count of collected events on user1's side expected:<1> but was:<0>
        at junit.framework.Assert.fail(Assert.java:47)
        at junit.framework.Assert.failNotEquals(Assert.java:282)
        at junit.framework.Assert.assertEquals(Assert.java:64)
        at junit.framework.Assert.assertEquals(Assert.java:201)
        at net.java.sip.communicator.slick.protocol.jabber.TestOperationSetMultiUserChat2.testGrantVoice(TestOperationSetMultiUserChat2.java:1610)
        at sun.reflect.NativeMethodAccessorImpl.invoke0(Native Method)
        at sun.reflect.NativeMethodAccessorImpl.invoke(NativeMethodAccessorImpl.java:57)
        at sun.reflect.DelegatingMethodAccessorImpl.invoke(DelegatingMethodAccessorImpl.java:43)
        at java.lang.reflect.Method.invoke(Method.java:616)
        at junit.framework.TestCase.runTest(TestCase.java:154)
        at junit.framework.TestCase.runBare(TestCase.java:127)
        at junit.framework.TestResult$1.protect(TestResult.java:106)
        at junit.framework.TestResult.runProtected(TestResult.java:124)
        at junit.framework.TestResult.run(TestResult.java:109)
        at junit.framework.TestCase.run(TestCase.java:118)
        at junit.framework.TestSuite.runTest(TestSuite.java:208)
        at junit.framework.TestSuite.run(TestSuite.java:203)
        at junit.framework.TestSuite.runTest(TestSuite.java:208)
        at junit.framework.TestSuite.run(TestSuite.java:203)
        at net.java.sip.communicator.slick.runner.ScTestRunner.doRun(ScTestRunner.java:108)
        at net.java.sip.communicator.slick.runner.ScTestRunner.doRun(ScTestRunner.java:98)
        at net.java.sip.communicator.slick.runner.ScTestRunner.run(ScTestRunner.java:56)
        at net.java.sip.communicator.slick.runner.SipCommunicatorSlickRunner.start(SipCommunicatorSlickRunner.java:151)
        at org.apache.felix.framework.util.SecureAction.startActivator(SecureAction.java:629)
        at org.apache.felix.framework.Felix.activateBundle(Felix.java:1904)
        at org.apache.felix.framework.Felix.startBundle(Felix.java:1822)
        at org.apache.felix.framework.Felix.setActiveStartLevel(Felix.java:1192)
        at org.apache.felix.framework.StartLevelImpl.run(StartLevelImpl.java:266)
        at java.lang.Thread.run(Thread.java:679)

FAILED: net.java.sip.communicator.slick.protocol.jabber.TestOperationSetMultiUserChat2.TestOperationSetMultiUserChat2.testRevokeModerator

Error Message:
Wrong count of collected events on user1's side expected:<1> but was:<0>

Stack Trace:
junit.framework.AssertionFailedError: Wrong count of collected events on user1's side expected:<1> but was:<0>
        at junit.framework.Assert.fail(Assert.java:47)
        at junit.framework.Assert.failNotEquals(Assert.java:282)
        at junit.framework.Assert.assertEquals(Assert.java:64)
        at junit.framework.Assert.assertEquals(Assert.java:201)
        at net.java.sip.communicator.slick.protocol.jabber.TestOperationSetMultiUserChat2.testRevokeModerator(TestOperationSetMultiUserChat2.java:1867)
        at sun.reflect.NativeMethodAccessorImpl.invoke0(Native Method)
        at sun.reflect.NativeMethodAccessorImpl.invoke(NativeMethodAccessorImpl.java:57)
        at sun.reflect.DelegatingMethodAccessorImpl.invoke(DelegatingMethodAccessorImpl.java:43)
        at java.lang.reflect.Method.invoke(Method.java:616)
        at junit.framework.TestCase.runTest(TestCase.java:154)
        at junit.framework.TestCase.runBare(TestCase.java:127)
        at junit.framework.TestResult$1.protect(TestResult.java:106)
        at junit.framework.TestResult.runProtected(TestResult.java:124)
        at junit.framework.TestResult.run(TestResult.java:109)
        at junit.framework.TestCase.run(TestCase.java:118)
        at junit.framework.TestSuite.runTest(TestSuite.java:208)
        at junit.framework.TestSuite.run(TestSuite.java:203)
        at junit.framework.TestSuite.runTest(TestSuite.java:208)
        at junit.framework.TestSuite.run(TestSuite.java:203)
        at net.java.sip.communicator.slick.runner.ScTestRunner.doRun(ScTestRunner.java:108)
        at net.java.sip.communicator.slick.runner.ScTestRunner.doRun(ScTestRunner.java:98)
        at net.java.sip.communicator.slick.runner.ScTestRunner.run(ScTestRunner.java:56)
        at net.java.sip.communicator.slick.runner.SipCommunicatorSlickRunner.start(SipCommunicatorSlickRunner.java:151)
        at org.apache.felix.framework.util.SecureAction.startActivator(SecureAction.java:629)
        at org.apache.felix.framework.Felix.activateBundle(Felix.java:1904)
        at org.apache.felix.framework.Felix.startBundle(Felix.java:1822)
        at org.apache.felix.framework.Felix.setActiveStartLevel(Felix.java:1192)
        at org.apache.felix.framework.StartLevelImpl.run(StartLevelImpl.java:266)
        at java.lang.Thread.run(Thread.java:679)

FAILED: net.java.sip.communicator.slick.protocol.jabber.TestOperationSetMultiUserChat2.TestOperationSetMultiUserChat2.testInitialParticipantsRoles

Error Message:
Failed to join room lmuctestroom9@conference.jit.si with nickname: jitsi2@jit.si

Stack Trace:
net.java.sip.communicator.service.protocol.OperationFailedException: Failed to join room lmuctestroom9@conference.jit.si with nickname: jitsi2@jit.si
        at net.java.sip.communicator.impl.protocol.jabber.ChatRoomJabberImpl.joinAs(ChatRoomJabberImpl.java:675)
        at net.java.sip.communicator.impl.protocol.jabber.ChatRoomJabberImpl.joinAs(ChatRoomJabberImpl.java:708)
        at net.java.sip.communicator.impl.protocol.jabber.ChatRoomJabberImpl.join(ChatRoomJabberImpl.java:557)
        at net.java.sip.communicator.slick.protocol.jabber.TestOperationSetMultiUserChat2.testInitialParticipantsRoles(TestOperationSetMultiUserChat2.java:1297)
        at sun.reflect.NativeMethodAccessorImpl.invoke0(Native Method)
        at sun.reflect.NativeMethodAccessorImpl.invoke(NativeMethodAccessorImpl.java:57)
        at sun.reflect.DelegatingMethodAccessorImpl.invoke(DelegatingMethodAccessorImpl.java:43)
        at java.lang.reflect.Method.invoke(Method.java:616)
        at junit.framework.TestCase.runTest(TestCase.java:154)
        at junit.framework.TestCase.runBare(TestCase.java:127)
        at junit.framework.TestResult$1.protect(TestResult.java:106)
        at junit.framework.TestResult.runProtected(TestResult.java:124)
        at junit.framework.TestResult.run(TestResult.java:109)
        at junit.framework.TestCase.run(TestCase.java:118)
        at junit.framework.TestSuite.runTest(TestSuite.java:208)
        at junit.framework.TestSuite.run(TestSuite.java:203)
        at junit.framework.TestSuite.runTest(TestSuite.java:208)
        at junit.framework.TestSuite.run(TestSuite.java:203)
        at net.java.sip.communicator.slick.runner.ScTestRunner.doRun(ScTestRunner.java:108)
        at net.java.sip.communicator.slick.runner.ScTestRunner.doRun(ScTestRunner.java:98)
        at net.java.sip.communicator.slick.runner.ScTestRunner.run(ScTestRunner.java:56)
        at net.java.sip.communicator.slick.runner.SipCommunicatorSlickRunner.start(SipCommunicatorSlickRunner.java:151)
        at org.apache.felix.framework.util.SecureAction.startActivator(SecureAction.java:629)
        at org.apache.felix.framework.Felix.activateBundle(Felix.java:1904)
        at org.apache.felix.framework.Felix.startBundle(Felix.java:1822)
        at org.apache.felix.framework.Felix.setActiveStartLevel(Felix.java:1192)
        at org.apache.felix.framework.StartLevelImpl.run(StartLevelImpl.java:266)
        at java.lang.Thread.run(Thread.java:679)
Caused by: recipient-unavailable(404)
        at org.jivesoftware.smackx.muc.MultiUserChat.join(MultiUserChat.java:504)
        at org.jivesoftware.smackx.muc.MultiUserChat.join(MultiUserChat.java:395)
        at net.java.sip.communicator.impl.protocol.jabber.ChatRoomJabberImpl.joinAs(ChatRoomJabberImpl.java:595)
        ... 27 more

FAILED: net.java.sip.communicator.slick.protocol.jabber.TestOperationSetMultiUserChat2.TestOperationSetMultiUserChat2.testGrantModerator

Error Message:
Wrong count of collected events on user1's side expected:<1> but was:<0>

Stack Trace:
junit.framework.AssertionFailedError: Wrong count of collected events on user1's side expected:<1> but was:<0>
        at junit.framework.Assert.fail(Assert.java:47)
        at junit.framework.Assert.failNotEquals(Assert.java:282)
        at junit.framework.Assert.assertEquals(Assert.java:64)
        at junit.framework.Assert.assertEquals(Assert.java:201)
        at net.java.sip.communicator.slick.protocol.jabber.TestOperationSetMultiUserChat2.testGrantModerator(TestOperationSetMultiUserChat2.java:1468)
        at sun.reflect.NativeMethodAccessorImpl.invoke0(Native Method)
        at sun.reflect.NativeMethodAccessorImpl.invoke(NativeMethodAccessorImpl.java:57)
        at sun.reflect.DelegatingMethodAccessorImpl.invoke(DelegatingMethodAccessorImpl.java:43)
        at java.lang.reflect.Method.invoke(Method.java:616)
        at junit.framework.TestCase.runTest(TestCase.java:154)
        at junit.framework.TestCase.runBare(TestCase.java:127)
        at junit.framework.TestResult$1.protect(TestResult.java:106)
        at junit.framework.TestResult.runProtected(TestResult.java:124)
        at junit.framework.TestResult.run(TestResult.java:109)
        at junit.framework.TestCase.run(TestCase.java:118)
        at junit.framework.TestSuite.runTest(TestSuite.java:208)
        at junit.framework.TestSuite.run(TestSuite.java:203)
        at junit.framework.TestSuite.runTest(TestSuite.java:208)
        at junit.framework.TestSuite.run(TestSuite.java:203)
        at net.java.sip.communicator.slick.runner.ScTestRunner.doRun(ScTestRunner.java:108)
        at net.java.sip.communicator.slick.runner.ScTestRunner.doRun(ScTestRunner.java:98)
        at net.java.sip.communicator.slick.runner.ScTestRunner.run(ScTestRunner.java:56)
        at net.java.sip.communicator.slick.runner.SipCommunicatorSlickRunner.start(SipCommunicatorSlickRunner.java:151)
        at org.apache.felix.framework.util.SecureAction.startActivator(SecureAction.java:629)
        at org.apache.felix.framework.Felix.activateBundle(Felix.java:1904)
        at org.apache.felix.framework.Felix.startBundle(Felix.java:1822)
        at org.apache.felix.framework.Felix.setActiveStartLevel(Felix.java:1192)
        at org.apache.felix.framework.StartLevelImpl.run(StartLevelImpl.java:266)
        at java.lang.Thread.run(Thread.java:679)

FAILED: net.java.sip.communicator.slick.protocol.jabber.TestOperationSetMultiUserChat2.TestOperationSetMultiUserChat2.testRevokeVoice

Error Message:
Wrong count of collected events on user1's side expected:<1> but was:<0>

Stack Trace:
junit.framework.AssertionFailedError: Wrong count of collected events on user1's side expected:<1> but was:<0>
        at junit.framework.Assert.fail(Assert.java:47)
        at junit.framework.Assert.failNotEquals(Assert.java:282)
        at junit.framework.Assert.assertEquals(Assert.java:64)
        at junit.framework.Assert.assertEquals(Assert.java:201)
        at net.java.sip.communicator.slick.protocol.jabber.TestOperationSetMultiUserChat2.testRevokeVoice(TestOperationSetMultiUserChat2.java:1540)
        at sun.reflect.NativeMethodAccessorImpl.invoke0(Native Method)
        at sun.reflect.NativeMethodAccessorImpl.invoke(NativeMethodAccessorImpl.java:57)
        at sun.reflect.DelegatingMethodAccessorImpl.invoke(DelegatingMethodAccessorImpl.java:43)
        at java.lang.reflect.Method.invoke(Method.java:616)
        at junit.framework.TestCase.runTest(TestCase.java:154)
        at junit.framework.TestCase.runBare(TestCase.java:127)
        at junit.framework.TestResult$1.protect(TestResult.java:106)
        at junit.framework.TestResult.runProtected(TestResult.java:124)
        at junit.framework.TestResult.run(TestResult.java:109)
        at junit.framework.TestCase.run(TestCase.java:118)
        at junit.framework.TestSuite.runTest(TestSuite.java:208)
        at junit.framework.TestSuite.run(TestSuite.java:203)
        at junit.framework.TestSuite.runTest(TestSuite.java:208)
        at junit.framework.TestSuite.run(TestSuite.java:203)
        at net.java.sip.communicator.slick.runner.ScTestRunner.doRun(ScTestRunner.java:108)
        at net.java.sip.communicator.slick.runner.ScTestRunner.doRun(ScTestRunner.java:98)
        at net.java.sip.communicator.slick.runner.ScTestRunner.run(ScTestRunner.java:56)
        at net.java.sip.communicator.slick.runner.SipCommunicatorSlickRunner.start(SipCommunicatorSlickRunner.java:151)
        at org.apache.felix.framework.util.SecureAction.startActivator(SecureAction.java:629)
        at org.apache.felix.framework.Felix.activateBundle(Felix.java:1904)
        at org.apache.felix.framework.Felix.startBundle(Felix.java:1822)
        at org.apache.felix.framework.Felix.setActiveStartLevel(Felix.java:1192)
        at org.apache.felix.framework.StartLevelImpl.run(StartLevelImpl.java:266)
        at java.lang.Thread.run(Thread.java:679)

FAILED: net.java.sip.communicator.slick.protocol.jabber.TestOperationSetMultiUserChat2.TestOperationSetMultiUserChat2.testGrantVoice

Error Message:
Wrong count of collected events on user1's side expected:<1> but was:<0>

Stack Trace:
junit.framework.AssertionFailedError: Wrong count of collected events on user1's side expected:<1> but was:<0>
        at junit.framework.Assert.fail(Assert.java:47)
        at junit.framework.Assert.failNotEquals(Assert.java:282)
        at junit.framework.Assert.assertEquals(Assert.java:64)
        at junit.framework.Assert.assertEquals(Assert.java:201)
        at net.java.sip.communicator.slick.protocol.jabber.TestOperationSetMultiUserChat2.testGrantVoice(TestOperationSetMultiUserChat2.java:1610)
        at sun.reflect.NativeMethodAccessorImpl.invoke0(Native Method)
        at sun.reflect.NativeMethodAccessorImpl.invoke(NativeMethodAccessorImpl.java:57)
        at sun.reflect.DelegatingMethodAccessorImpl.invoke(DelegatingMethodAccessorImpl.java:43)
        at java.lang.reflect.Method.invoke(Method.java:616)
        at junit.framework.TestCase.runTest(TestCase.java:154)
        at junit.framework.TestCase.runBare(TestCase.java:127)
        at junit.framework.TestResult$1.protect(TestResult.java:106)
        at junit.framework.TestResult.runProtected(TestResult.java:124)
        at junit.framework.TestResult.run(TestResult.java:109)
        at junit.framework.TestCase.run(TestCase.java:118)
        at junit.framework.TestSuite.runTest(TestSuite.java:208)
        at junit.framework.TestSuite.run(TestSuite.java:203)
        at junit.framework.TestSuite.runTest(TestSuite.java:208)
        at junit.framework.TestSuite.run(TestSuite.java:203)
        at net.java.sip.communicator.slick.runner.ScTestRunner.doRun(ScTestRunner.java:108)
        at net.java.sip.communicator.slick.runner.ScTestRunner.doRun(ScTestRunner.java:98)
        at net.java.sip.communicator.slick.runner.ScTestRunner.run(ScTestRunner.java:56)
        at net.java.sip.communicator.slick.runner.SipCommunicatorSlickRunner.start(SipCommunicatorSlickRunner.java:151)
        at org.apache.felix.framework.util.SecureAction.startActivator(SecureAction.java:629)
        at org.apache.felix.framework.Felix.activateBundle(Felix.java:1904)
        at org.apache.felix.framework.Felix.startBundle(Felix.java:1822)
        at org.apache.felix.framework.Felix.setActiveStartLevel(Felix.java:1192)
        at org.apache.felix.framework.StartLevelImpl.run(StartLevelImpl.java:266)
        at java.lang.Thread.run(Thread.java:679)

FAILED: net.java.sip.communicator.slick.protocol.jabber.TestOperationSetMultiUserChat2.TestOperationSetMultiUserChat2.testRevokeModerator

Error Message:
Wrong count of collected events on user1's side expected:<1> but was:<0>

Stack Trace:
junit.framework.AssertionFailedError: Wrong count of collected events on user1's side expected:<1> but was:<0>
        at junit.framework.Assert.fail(Assert.java:47)
        at junit.framework.Assert.failNotEquals(Assert.java:282)
        at junit.framework.Assert.assertEquals(Assert.java:64)
        at junit.framework.Assert.assertEquals(Assert.java:201)
        at net.java.sip.communicator.slick.protocol.jabber.TestOperationSetMultiUserChat2.testRevokeModerator(TestOperationSetMultiUserChat2.java:1867)
        at sun.reflect.NativeMethodAccessorImpl.invoke0(Native Method)
        at sun.reflect.NativeMethodAccessorImpl.invoke(NativeMethodAccessorImpl.java:57)
        at sun.reflect.DelegatingMethodAccessorImpl.invoke(DelegatingMethodAccessorImpl.java:43)
        at java.lang.reflect.Method.invoke(Method.java:616)
        at junit.framework.TestCase.runTest(TestCase.java:154)
        at junit.framework.TestCase.runBare(TestCase.java:127)
        at junit.framework.TestResult$1.protect(TestResult.java:106)
        at junit.framework.TestResult.runProtected(TestResult.java:124)
        at junit.framework.TestResult.run(TestResult.java:109)
        at junit.framework.TestCase.run(TestCase.java:118)
        at junit.framework.TestSuite.runTest(TestSuite.java:208)
        at junit.framework.TestSuite.run(TestSuite.java:203)
        at junit.framework.TestSuite.runTest(TestSuite.java:208)
        at junit.framework.TestSuite.run(TestSuite.java:203)
        at net.java.sip.communicator.slick.runner.ScTestRunner.doRun(ScTestRunner.java:108)
        at net.java.sip.communicator.slick.runner.ScTestRunner.doRun(ScTestRunner.java:98)
        at net.java.sip.communicator.slick.runner.ScTestRunner.run(ScTestRunner.java:56)
        at net.java.sip.communicator.slick.runner.SipCommunicatorSlickRunner.start(SipCommunicatorSlickRunner.java:151)
        at org.apache.felix.framework.util.SecureAction.startActivator(SecureAction.java:629)
        at org.apache.felix.framework.Felix.activateBundle(Felix.java:1904)
        at org.apache.felix.framework.Felix.startBundle(Felix.java:1822)
        at org.apache.felix.framework.Felix.setActiveStartLevel(Felix.java:1192)
        at org.apache.felix.framework.StartLevelImpl.run(StartLevelImpl.java:266)
        at java.lang.Thread.run(Thread.java:679)

http://jenkins.jitsi.net/job/jitsi/4980/

_______________________________________________
cruisecontrol mailing list
cruisecontrol@jitsi.org
Unsubscribe instructions and other list options:
http://lists.jitsi.org/mailman/listinfo/cruisecontrol


#2

Does anyone have an idea how to fix TestOperationSetMultiUserChat2?
It's often failing and it appears to me that most of the time there
have been no changes related to multi-user chat whatsoever.

Well, first idea might be to include the reason why the join failed into the
error message. As this is an integration test, it might be network or server
related (e.g. the user is still logged in from a previous session, the
server denies the login in an attempt to block repeated retries etc.)

Ingo