[jitsi-dev] I have one problem for making Installer


#1

Hi,
    I installed Cygwin,Mingw and all related tools. I run wix build and i
got one error.That is

[mkdir] Created dir: E:\Pumex_project\Pharmacy\release\windows\tmp\light
     [exec] makefile:42: *** target pattern contains no `%'. Stop.

BUILD FAILED
E:\Pumex_project\Pharmacy\resources\install\build.xml:289: The following
error occurred while executing this line:
E:\Pumex_project\Pharmacy\resources\install\build.xml:447: exec returned: 2

···

--
Thanks & Regards,

*Vishnu A U* *.*


#2

Hi,

make sure that in the release/windows/tmp/light/config.h file, you have
something like this:

*#define PRODUCTNAME "Jitsi"*
*#define COMPANYNAME "jitsi.org <http://jitsi.org>"*
*#define PRODUCTBUILDVERSION "2.5.0.build.by.SVN"*
*#define TARGET_BASENAME "Jitsi"*
*#define TARGET_BASENAME_EXE "Jitsi.exe"*

If you have some extra single quotes, just remove them.

Also, in the makefiles:
*src\native\windows\setup*

*src\native\windows\setup\cleansweep*
*src\native\windows\run*

do what is written here:
http://stackoverflow.com/questions/14495465/installer-for-jitsi-sip-communicator

It should look like this:
-in \Windows\run I have

-rm.exe -f ../../../../resources/install/
windows/config.h
    echo '#define PRODUCTNAME "$(PRODUCTNAME)" '>
$(cygwin.target.dir)/config.h
    echo '#define COMPANYNAME "$(COMPANYNAME)" '>>
$(cygwin.target.dir)/config.h
    echo '#define PRODUCTBUILDVERSION "$(PRODUCTBUILDVERSION)" '>>
$(cygwin.target.dir)/config.h
    echo '#define TARGET_BASENAME "$(TARGET_BASENAME)"' >>
$(cygwin.target.dir)/config.h
    echo '#define TARGET_BASENAME_EXE "$(TARGET_BASENAME).exe"' >>
$(cygwin.target.dir)/config.h

in \Windows\Setup\Cleansweep I have
-rm.exe -f ../../../../../resources/install/windows/config.h
    echo '#define PRODUCTNAME "$(PRODUCTNAME)" '>
$(cygwin.target.dir)/config.h
    echo '#$(DEFINE_PACKAGECODE)' >> $(cygwin.target.dir)/config.h

and in \Windows\Setup I have
-rm.exe -f ../../../../resources/install/
windows/config.h
    echo '#define PRODUCTNAME "$(PRODUCTNAME)" '>
$(cygwin.target.dir)/config.h
    echo '#$(DEFINE_PACKAGECODE)' >> $(cygwin.target.dir)/config.h
    echo '#$(DEFINE_PACKAGESIZE)' >> $(cygwin.target.dir)/config.h
    echo '#define PRODUCTBUILDVERSION "$(PRODUCTBUILDVERSION)"' >>
$(cygwin.target.dir)/config.h

Hope that helped.

···

2015-02-10 14:44 GMT+01:00 ViShNu UnNi <ampady1987@gmail.com>:

Hi,
    I installed Cygwin,Mingw and all related tools. I run wix build and i
got one error.That is

[mkdir] Created dir: E:\Pumex_project\Pharmacy\release\windows\tmp\light
     [exec] makefile:42: *** target pattern contains no `%'. Stop.

BUILD FAILED
E:\Pumex_project\Pharmacy\resources\install\build.xml:289: The following
error occurred while executing this line:
E:\Pumex_project\Pharmacy\resources\install\build.xml:447: exec returned: 2

--
Thanks & Regards,

*Vishnu A U* *.*

_______________________________________________
dev mailing list
dev@jitsi.org
Unsubscribe instructions and other list options:
http://lists.jitsi.org/mailman/listinfo/dev

--


#3

hi ,

                               Thank you Evangelos Nannos.I tried what you
suggested, still i got error.

[propertyfile] Creating new property file:
E:\Pumex_project\Pharmacy\release\windows\versionupdate.properties
    [mkdir] Created dir: E:\Pumex_project\Pharmacy\release\windows\tmp\light
     [exec] rm.exe -f ..\..\..\..\resources\install\windows\config.h
     [exec] Makefile:49: recipe for target
'E:\Pumex_project\Pharmacy\release\windows\tmp\light\config.h' failed
     [exec] echo #define PRODUCTNAME "Jitsi" >
E:\Pumex_project\Pharmacy\release\windows\tmp\light\config.h
     [exec] process_begin: CreateProcess(NULL, rm.exe -f
..\..\..\..\resources\install\windows\config.h, ...) failed.
     [exec] make (e=2): The system cannot find the file specified.
     [exec] make.exe:
[E:\Pumex_project\Pharmacy\release\windows\tmp\light\config.h] Error 2
(ignored)
     [exec] C:\MinGW\bin\windres.exe
-I..\..\..\..\resources\install\windows
-IE:\Pumex_project\Pharmacy\release\windows\tmp\light run.rc -O coff -o
E:\Pumex_project\Pharmacy\release\windows\tmp\light\run.res
     [exec] Makefile:54: recipe for target
'E:\Pumex_project\Pharmacy\release\windows\tmp\light\run.res' failed
     [exec] C:\MinGW\bin\windres.exe: run.rc:33: syntax error
     [exec] make.exe: ***
[E:\Pumex_project\Pharmacy\release\windows\tmp\light\run.res] Error 1

the above error getting while i run command in mingw. Please help

···

On Wed, Feb 11, 2015 at 1:36 AM, Evangelos Nannos <enannos@gmail.com> wrote:

Hi,

make sure that in the release/windows/tmp/light/config.h file, you have
something like this:

*#define PRODUCTNAME "Jitsi"*
*#define COMPANYNAME "jitsi.org <http://jitsi.org>"*
*#define PRODUCTBUILDVERSION "2.5.0.build.by.SVN"*
*#define TARGET_BASENAME "Jitsi"*
*#define TARGET_BASENAME_EXE "Jitsi.exe"*

If you have some extra single quotes, just remove them.

Also, in the makefiles:
*src\native\windows\setup*

*src\native\windows\setup\cleansweep*
*src\native\windows\run*

do what is written here:

http://stackoverflow.com/questions/14495465/installer-for-jitsi-sip-communicator

It should look like this:
-in \Windows\run I have

-rm.exe -f ../../../../resources/install/
windows/config.h
    echo '#define PRODUCTNAME "$(PRODUCTNAME)" '>
$(cygwin.target.dir)/config.h
    echo '#define COMPANYNAME "$(COMPANYNAME)" '>>
$(cygwin.target.dir)/config.h
    echo '#define PRODUCTBUILDVERSION "$(PRODUCTBUILDVERSION)" '>>
$(cygwin.target.dir)/config.h
    echo '#define TARGET_BASENAME "$(TARGET_BASENAME)"' >>
$(cygwin.target.dir)/config.h
    echo '#define TARGET_BASENAME_EXE "$(TARGET_BASENAME).exe"' >>
$(cygwin.target.dir)/config.h

in \Windows\Setup\Cleansweep I have
-rm.exe -f ../../../../../resources/install/windows/config.h
    echo '#define PRODUCTNAME "$(PRODUCTNAME)" '>
$(cygwin.target.dir)/config.h
    echo '#$(DEFINE_PACKAGECODE)' >> $(cygwin.target.dir)/config.h

and in \Windows\Setup I have
-rm.exe -f ../../../../resources/install/
windows/config.h
    echo '#define PRODUCTNAME "$(PRODUCTNAME)" '>
$(cygwin.target.dir)/config.h
    echo '#$(DEFINE_PACKAGECODE)' >> $(cygwin.target.dir)/config.h
    echo '#$(DEFINE_PACKAGESIZE)' >> $(cygwin.target.dir)/config.h
    echo '#define PRODUCTBUILDVERSION "$(PRODUCTBUILDVERSION)"' >>
$(cygwin.target.dir)/config.h

Hope that helped.

2015-02-10 14:44 GMT+01:00 ViShNu UnNi <ampady1987@gmail.com>:

Hi,
    I installed Cygwin,Mingw and all related tools. I run wix build and i
got one error.That is

[mkdir] Created dir: E:\Pumex_project\Pharmacy\release\windows\tmp\light
     [exec] makefile:42: *** target pattern contains no `%'. Stop.

BUILD FAILED
E:\Pumex_project\Pharmacy\resources\install\build.xml:289: The following
error occurred while executing this line:
E:\Pumex_project\Pharmacy\resources\install\build.xml:447: exec returned:
2

--
Thanks & Regards,

*Vishnu A U* *.*

_______________________________________________
dev mailing list
dev@jitsi.org
Unsubscribe instructions and other list options:
http://lists.jitsi.org/mailman/listinfo/dev

--

_______________________________________________
dev mailing list
dev@jitsi.org
Unsubscribe instructions and other list options:
http://lists.jitsi.org/mailman/listinfo/dev

--
Thanks & Regards,

*Vishnu A U* *.*


#4

"build.by.SVN" or the like don't work in the version number anymore. You need a numeric version. AFAIK that's e.g. ant <target> -Dlabel=123

Ingo

···

-----Original Message-----
From: dev [mailto:dev-bounces@jitsi.org] On Behalf Of ViShNu UnNi
Sent: Mittwoch, 18. Februar 2015 10:50
To: Jitsi Developers
Subject: Re: [jitsi-dev] I have one problem for making Installer
hi ,

                               Thank you Evangelos Nannos.I tried what you
suggested, still i got error.

[propertyfile] Creating new property file:
E:\Pumex_project\Pharmacy\release\windows\versionupdate.properties
    [mkdir] Created dir: E:\Pumex_project\Pharmacy\release\windows\tmp\light
     [exec] rm.exe -f ..\..\..\..\resources\install\windows\config.h
     [exec] Makefile:49: recipe for target
     'E:\Pumex_project\Pharmacy\release\windows\tmp\light\config.h'
     failed [exec] echo #define PRODUCTNAME "Jitsi" >
     E:\Pumex_project\Pharmacy\release\windows\tmp\light\config.h [exec]
     process_begin: CreateProcess(NULL, rm.exe -f
     ..\..\..\..\resources\install\windows\config.h, ...) failed. [exec]
     make (e=2): The system cannot find the file specified. [exec]
     make.exe:
[E:\Pumex_project\Pharmacy\release\windows\tmp\light\config.h] Error 2
(ignored)
     [exec] C:\MinGW\bin\windres.exe -I..\..\..\..\resources\install\windows
-IE:\Pumex_project\Pharmacy\release\windows\tmp\light run.rc -O coff -o
E:\Pumex_project\Pharmacy\release\windows\tmp\light\run.res
     [exec] Makefile:54: recipe for target
     'E:\Pumex_project\Pharmacy\release\windows\tmp\light\run.res'
     failed [exec] C:\MinGW\bin\windres.exe: run.rc:33: syntax error
     [exec] make.exe: ***
[E:\Pumex_project\Pharmacy\release\windows\tmp\light\run.res] Error 1

the above error getting while i run command in mingw. Please help

On Wed, Feb 11, 2015 at 1:36 AM, Evangelos Nannos <enannos@gmail.com> wrote:

  Hi,

  make sure that in the release/windows/tmp/light/config.h file, you
have something like this:

  #define PRODUCTNAME "Jitsi"
  #define COMPANYNAME "jitsi.org <http://jitsi.org> "
  #define PRODUCTBUILDVERSION "2.5.0.build.by.SVN"
  #define TARGET_BASENAME "Jitsi"
  #define TARGET_BASENAME_EXE "Jitsi.exe"
   <https://ssl.gstatic.com/ui/v1/icons/mail/images/cleardot.gif>

  If you have some extra single quotes, just remove them.

  Also, in the makefiles:

  src\native\windows\setup
  src\native\windows\setup\cleansweep

  src\native\windows\run

  do what is written here:
  http://stackoverflow.com/questions/14495465/installer-for-jitsi-sip-
communicator

  It should look like this:
  -in \Windows\run I have

  -rm.exe -f ../../../../resources/install/ windows/config.h echo
'#define PRODUCTNAME "$(PRODUCTNAME)" '> $(cygwin.target.dir)/config.h
   echo '#define COMPANYNAME "$(COMPANYNAME)" '>>
$(cygwin.target.dir)/config.h echo '#define PRODUCTBUILDVERSION
"$(PRODUCTBUILDVERSION)" '>> $(cygwin.target.dir)/config.h echo
'#define TARGET_BASENAME "$(TARGET_BASENAME)"' >>
$(cygwin.target.dir)/config.h echo '#define TARGET_BASENAME_EXE
"$(TARGET_BASENAME).exe"' >> $(cygwin.target.dir)/config.h

  in \Windows\Setup\Cleansweep I have

  -rm.exe -f ../../../../../resources/install/windows/config.h echo
'#define PRODUCTNAME "$(PRODUCTNAME)" '> $(cygwin.target.dir)/config.h
   echo '#$(DEFINE_PACKAGECODE)' >> $(cygwin.target.dir)/config.h

  and in \Windows\Setup I have -rm.exe -f ../../../../resources/install/
  windows/config.h echo '#define PRODUCTNAME "$(PRODUCTNAME)" '>
$(cygwin.target.dir)/config.h echo '#$(DEFINE_PACKAGECODE)' >>
$(cygwin.target.dir)/config.h echo '#$(DEFINE_PACKAGESIZE)' >>
$(cygwin.target.dir)/config.h echo '#define PRODUCTBUILDVERSION
"$(PRODUCTBUILDVERSION)"' >> $(cygwin.target.dir)/config.h

  Hope that helped.

  2015-02-10 14:44 GMT+01:00 ViShNu UnNi <ampady1987@gmail.com>:

    Hi,

        I installed Cygwin,Mingw and all related tools. I run wix
build and i got one error.That is

    [mkdir] Created dir:
E:\Pumex_project\Pharmacy\release\windows\tmp\light [exec]
makefile:42: *** target pattern contains no `%'. Stop.

    BUILD FAILED
    E:\Pumex_project\Pharmacy\resources\install\build.xml:289: The
following error occurred while executing this line:
    E:\Pumex_project\Pharmacy\resources\install\build.xml:447: exec
returned: 2

    --

    Thanks & Regards,

    Vishnu A U .

    _______________________________________________ dev mailing list
    dev@jitsi.org Unsubscribe instructions and other list options:
    http://lists.jitsi.org/mailman/listinfo/dev

  --

  _______________________________________________ dev mailing list
  dev@jitsi.org Unsubscribe instructions and other list options:
  http://lists.jitsi.org/mailman/listinfo/dev


#5

Hi,
     Still the issue continues......

Buildfile: E:\Pumex_project\Pharmacy\build.xml
-pre-version:
version:
    [javac] Compiling 3 source files to E:\Pumex_project\Pharmacy\classes
    [javac] warning: [options] bootstrap class path not set in conjunction
with -source 1.6
    [javac] 1 warning
     [echo] Jitsi version 2.5.0
load-properties:
build-installation-wix:
clean-install-windows:
   [delete] Deleting directory E:\Pumex_project\Pharmacy\release\windows
    [mkdir] Created dir: E:\Pumex_project\Pharmacy\release\windows
    [mkdir] Created dir: E:\Pumex_project\Pharmacy\release\windows\tmp
define-ant-contrib-task:
  [taskdef] Could not load definitions from resource
net\sf\antcontrib\antlib.xml. It could not be found.
build-installation-wix-base:
[propertyfile] Creating new property file:
E:\Pumex_project\Pharmacy\release\windows\versionupdate.properties
    [mkdir] Created dir: E:\Pumex_project\Pharmacy\release\windows\tmp\light
     [exec] rm.exe -f ..\..\..\..\resources\install\windows\config.h
     [exec] Makefile:49: recipe for target
'E:\Pumex_project\Pharmacy\release\windows\tmp\light\config.h' failed
     [exec] process_begin: CreateProcess(NULL, rm.exe -f
..\..\..\..\resources\install\windows\config.h, ...) failed.
     [exec] make (e=2): The system cannot find the file specified.
     [exec] make.exe:
[E:\Pumex_project\Pharmacy\release\windows\tmp\light\config.h] Error 2
(ignored)
     [exec] echo #define PRODUCTNAME "Jitsi" >
E:\Pumex_project\Pharmacy\release\windows\tmp\light\config.h
     [exec] echo #define PRODUCTBUILDVERSION "2.5.0" >>
E:\Pumex_project\Pharmacy\release\windows\tmp\light\config.h
     [exec] echo #define TARGET_BASENAME "Jitsi" >>
E:\Pumex_project\Pharmacy\release\windows\tmp\light\config.h
     [exec] echo #define TARGET_BASENAME_EXE "Jitsi.exe" >>
E:\Pumex_project\Pharmacy\release\windows\tmp\light\config.h
     [exec] C:\MinGW\bin\windres.exe
-I..\..\..\..\resources\install\windows
-IE:\Pumex_project\Pharmacy\release\windows\tmp\light run.rc -O coff -o
E:\Pumex_project\Pharmacy\release\windows\tmp\light\run.res
     [exec] Makefile:56: recipe for target
'E:\Pumex_project\Pharmacy\release\windows\tmp\light\run.res' failed
     [exec] C:\MinGW\bin\windres.exe: run.rc:33: syntax error
     [exec] make.exe: ***
[E:\Pumex_project\Pharmacy\release\windows\tmp\light\run.res] Error 1

BUILD FAILED
E:\Pumex_project\Pharmacy\resources\install\build.xml:289: The following
error occurred while executing this line:
E:\Pumex_project\Pharmacy\resources\install\build.xml:447: exec returned: 2

this is the error getting by running the command Pls help

···

On Wed, Feb 18, 2015 at 3:39 PM, Ingo Bauersachs <ingo@jitsi.org> wrote:

"build.by.SVN" or the like don't work in the version number anymore. You
need a numeric version. AFAIK that's e.g. ant <target> -Dlabel=123

Ingo

> -----Original Message-----
> From: dev [mailto:dev-bounces@jitsi.org] On Behalf Of ViShNu UnNi
> Sent: Mittwoch, 18. Februar 2015 10:50
> To: Jitsi Developers
> Subject: Re: [jitsi-dev] I have one problem for making Installer
> hi ,
>
> Thank you Evangelos Nannos.I tried what
you
> suggested, still i got error.
>
>
>
> [propertyfile] Creating new property file:
> E:\Pumex_project\Pharmacy\release\windows\versionupdate.properties
> [mkdir] Created dir:
E:\Pumex_project\Pharmacy\release\windows\tmp\light
> [exec] rm.exe -f ..\..\..\..\resources\install\windows\config.h
> [exec] Makefile:49: recipe for target
> 'E:\Pumex_project\Pharmacy\release\windows\tmp\light\config.h'
> failed [exec] echo #define PRODUCTNAME "Jitsi" >
> E:\Pumex_project\Pharmacy\release\windows\tmp\light\config.h [exec]
> process_begin: CreateProcess(NULL, rm.exe -f
> ..\..\..\..\resources\install\windows\config.h, ...) failed. [exec]
> make (e=2): The system cannot find the file specified. [exec]
> make.exe:
> [E:\Pumex_project\Pharmacy\release\windows\tmp\light\config.h] Error 2
> (ignored)
> [exec] C:\MinGW\bin\windres.exe
-I..\..\..\..\resources\install\windows
> -IE:\Pumex_project\Pharmacy\release\windows\tmp\light run.rc -O coff -o
> E:\Pumex_project\Pharmacy\release\windows\tmp\light\run.res
> [exec] Makefile:54: recipe for target
> 'E:\Pumex_project\Pharmacy\release\windows\tmp\light\run.res'
> failed [exec] C:\MinGW\bin\windres.exe: run.rc:33: syntax error
> [exec] make.exe: ***
> [E:\Pumex_project\Pharmacy\release\windows\tmp\light\run.res] Error 1
>
>
>
> the above error getting while i run command in mingw. Please help
>
>
> On Wed, Feb 11, 2015 at 1:36 AM, Evangelos Nannos <enannos@gmail.com> > wrote:
>
>
> Hi,
>
> make sure that in the release/windows/tmp/light/config.h file, you
> have something like this:
>
>
> #define PRODUCTNAME "Jitsi"
> #define COMPANYNAME "jitsi.org <http://jitsi.org> "
> #define PRODUCTBUILDVERSION "2.5.0.build.by.SVN"
> #define TARGET_BASENAME "Jitsi"
> #define TARGET_BASENAME_EXE "Jitsi.exe"
> <https://ssl.gstatic.com/ui/v1/icons/mail/images/cleardot.gif>
>
> If you have some extra single quotes, just remove them.
>
>
> Also, in the makefiles:
>
> src\native\windows\setup
> src\native\windows\setup\cleansweep
>
> src\native\windows\run
>
>
> do what is written here:
>
http://stackoverflow.com/questions/14495465/installer-for-jitsi-sip-
> communicator
>
>
> It should look like this:
> -in \Windows\run I have
>
> -rm.exe -f ../../../../resources/install/ windows/config.h
          echo
> '#define PRODUCTNAME "$(PRODUCTNAME)" '> $(cygwin.target.dir)/config.h
> echo '#define COMPANYNAME "$(COMPANYNAME)" '>>
> $(cygwin.target.dir)/config.h echo '#define
PRODUCTBUILDVERSION
> "$(PRODUCTBUILDVERSION)" '>> $(cygwin.target.dir)/config.h echo
> '#define TARGET_BASENAME "$(TARGET_BASENAME)"' >>
> $(cygwin.target.dir)/config.h echo '#define
TARGET_BASENAME_EXE
> "$(TARGET_BASENAME).exe"' >> $(cygwin.target.dir)/config.h
>
>
>
>
> in \Windows\Setup\Cleansweep I have
>
> -rm.exe -f ../../../../../resources/install/windows/config.h
  echo
> '#define PRODUCTNAME "$(PRODUCTNAME)" '> $(cygwin.target.dir)/config.h
> echo '#$(DEFINE_PACKAGECODE)' >> $(cygwin.target.dir)/config.h
>
>
>
> and in \Windows\Setup I have -rm.exe -f
../../../../resources/install/
> windows/config.h echo '#define PRODUCTNAME
"$(PRODUCTNAME)" '>
> $(cygwin.target.dir)/config.h echo '#$(DEFINE_PACKAGECODE)'
>>
> $(cygwin.target.dir)/config.h echo '#$(DEFINE_PACKAGESIZE)'
>>
> $(cygwin.target.dir)/config.h echo '#define
PRODUCTBUILDVERSION
> "$(PRODUCTBUILDVERSION)"' >> $(cygwin.target.dir)/config.h
>
>
> Hope that helped.
>
>
>
>
> 2015-02-10 14:44 GMT+01:00 ViShNu UnNi <ampady1987@gmail.com>:
>
>
> Hi,
>
> I installed Cygwin,Mingw and all related tools. I run
wix
> build and i got one error.That is
>
> [mkdir] Created dir:
> E:\Pumex_project\Pharmacy\release\windows\tmp\light [exec]
> makefile:42: *** target pattern contains no `%'. Stop.
>
> BUILD FAILED
> E:\Pumex_project\Pharmacy\resources\install\build.xml:289:
The
> following error occurred while executing this line:
> E:\Pumex_project\Pharmacy\resources\install\build.xml:447:
exec
> returned: 2
>
>
>
>
>
> --
>
> Thanks & Regards,
>
>
> Vishnu A U .
>
>
>
> _______________________________________________
     dev mailing list
> dev@jitsi.org Unsubscribe instructions and
other list options:
> http://lists.jitsi.org/mailman/listinfo/dev
>
>
>
>
>
> --
>
>
> _______________________________________________ dev
mailing list
> dev@jitsi.org Unsubscribe instructions and other list options:
> http://lists.jitsi.org/mailman/listinfo/dev
>
>
>
>
>

_______________________________________________
dev mailing list
dev@jitsi.org
Unsubscribe instructions and other list options:
http://lists.jitsi.org/mailman/listinfo/dev

--
Thanks & Regards,

*Vishnu A U* *.*


#6

Are you actually building 2.5 sources? If not get your stuff together with up to date files. Otherwise it probably needs a double build-id as well (e.g. -Dlabel=0.0)
Then do some research about the content of run.rc on line 33, how it looks in your file and what windres expects.

Ingo

···

-----Original Message-----
From: dev [mailto:dev-bounces@jitsi.org] On Behalf Of ViShNu UnNi
Sent: Mittwoch, 18. Februar 2015 12:15
To: Jitsi Developers
Subject: Re: [jitsi-dev] I have one problem for making Installer
Hi,

     Still the issue continues......
Buildfile: E:\Pumex_project\Pharmacy\build.xml
-pre-version:
version:
    [javac] Compiling 3 source files to
    E:\Pumex_project\Pharmacy\classes [javac] warning: [options]
    bootstrap class path not set in conjunction with -source 1.6 [javac]
    1 warning
     [echo] Jitsi version 2.5.0
load-properties:
build-installation-wix:
clean-install-windows:
   [delete] Deleting directory E:\Pumex_project\Pharmacy\release\windows
    [mkdir] Created dir: E:\Pumex_project\Pharmacy\release\windows
    [mkdir] Created dir: E:\Pumex_project\Pharmacy\release\windows\tmp
define-ant-contrib-task:
  [taskdef] Could not load definitions from resource
net\sf\antcontrib\antlib.xml. It could not be found.
build-installation-wix-base: [propertyfile] Creating new property file:
E:\Pumex_project\Pharmacy\release\windows\versionupdate.properties
    [mkdir] Created dir: E:\Pumex_project\Pharmacy\release\windows\tmp\light
     [exec] rm.exe -f ..\..\..\..\resources\install\windows\config.h
     [exec] Makefile:49: recipe for target
     'E:\Pumex_project\Pharmacy\release\windows\tmp\light\config.h'
     failed [exec] process_begin: CreateProcess(NULL, rm.exe -f
     ..\..\..\..\resources\install\windows\config.h, ...) failed. [exec]
     make (e=2): The system cannot find the file specified. [exec]
     make.exe:
[E:\Pumex_project\Pharmacy\release\windows\tmp\light\config.h] Error 2
(ignored)
     [exec] echo #define PRODUCTNAME "Jitsi" >
     E:\Pumex_project\Pharmacy\release\windows\tmp\light\config.h [exec]
     echo #define PRODUCTBUILDVERSION "2.5.0" >>
     E:\Pumex_project\Pharmacy\release\windows\tmp\light\config.h [exec]
     echo #define TARGET_BASENAME "Jitsi" >>
     E:\Pumex_project\Pharmacy\release\windows\tmp\light\config.h [exec]
     echo #define TARGET_BASENAME_EXE "Jitsi.exe" >>
     E:\Pumex_project\Pharmacy\release\windows\tmp\light\config.h [exec]
     C:\MinGW\bin\windres.exe -I..\..\..\..\resources\install\windows
-IE:\Pumex_project\Pharmacy\release\windows\tmp\light run.rc -O coff -o
E:\Pumex_project\Pharmacy\release\windows\tmp\light\run.res
     [exec] Makefile:56: recipe for target
     'E:\Pumex_project\Pharmacy\release\windows\tmp\light\run.res'
     failed [exec] C:\MinGW\bin\windres.exe: run.rc:33: syntax error
     [exec] make.exe: ***
[E:\Pumex_project\Pharmacy\release\windows\tmp\light\run.res] Error 1

BUILD FAILED
E:\Pumex_project\Pharmacy\resources\install\build.xml:289: The following
error occurred while executing this line:
E:\Pumex_project\Pharmacy\resources\install\build.xml:447: exec returned: 2

this is the error getting by running the command Pls help

On Wed, Feb 18, 2015 at 3:39 PM, Ingo Bauersachs <ingo@jitsi.org> wrote:

  "build.by.SVN" or the like don't work in the version number anymore.
You need a numeric version. AFAIK that's e.g. ant <target> -Dlabel=123

  Ingo

  > -----Original Message----- > From: dev
[mailto:dev-bounces@jitsi.org] On Behalf Of ViShNu UnNi > Sent:
Mittwoch, 18. Februar 2015 10:50 > To: Jitsi Developers > Subject: Re:
[jitsi-dev] I have one problem for making Installer > hi , > >
                        Thank you Evangelos Nannos.I tried what you >
suggested, still i got error. > > > > [propertyfile] Creating new
property file: >
E:\Pumex_project\Pharmacy\release\windows\versionupdate.properties >
[mkdir] Created dir:
E:\Pumex_project\Pharmacy\release\windows\tmp\light > [exec]
rm.exe -f ..\..\..\..\resources\install\windows\config.h > [exec]
Makefile:49: recipe for target >
'E:\Pumex_project\Pharmacy\release\windows\tmp\light\config.h' >
failed [exec] echo #define PRODUCTNAME "Jitsi" > >
E:\Pumex_project\Pharmacy\release\windows\tmp\light\config.h [exec] >
   process_begin: CreateProcess(NULL, rm.exe -f >
..\..\..\..\resources\install\windows\config.h, ...) failed. [exec] >
   make (e=2): The system cannot find the file specified. [exec] >
make.exe: >
[E:\Pumex_project\Pharmacy\release\windows\tmp\light\config.h] Error 2
  > (ignored) > [exec] C:\MinGW\bin\windres.exe -
I..\..\..\..\resources\install\windows >
-IE:\Pumex_project\Pharmacy\release\windows\tmp\light run.rc -O coff -o
  > E:\Pumex_project\Pharmacy\release\windows\tmp\light\run.res >
[exec] Makefile:54: recipe for target >
'E:\Pumex_project\Pharmacy\release\windows\tmp\light\run.res' >
failed [exec] C:\MinGW\bin\windres.exe: run.rc:33: syntax error >
[exec] make.exe: *** >
[E:\Pumex_project\Pharmacy\release\windows\tmp\light\run.res] Error 1 >
  > > > the above error getting while i run command in mingw. Please
help > > > On Wed, Feb 11, 2015 at 1:36 AM, Evangelos Nannos
<enannos@gmail.com> wrote: > > > Hi, > > make sure that
in the release/windows/tmp/light/config.h file, you > have something
like this: > > > #define PRODUCTNAME "Jitsi"

  > #define COMPANYNAME "jitsi.org <http://jitsi.org> " >
#define PRODUCTBUILDVERSION "2.5.0.build.by.SVN" > #define
TARGET_BASENAME "Jitsi" > #define TARGET_BASENAME_EXE "Jitsi.exe"
  > <https://ssl.gstatic.com/ui/v1/icons/mail/images/cleardot.gif>

  > > If you have some extra single quotes, just remove them. >
  > > Also, in the makefiles: > > src\native\windows\setup
  > src\native\windows\setup\cleansweep > >
src\native\windows\run > > > do what is written here: >
http://stackoverflow.com/questions/14495465/installer-for- jitsi-sip- >
communicator > > > It should look like this: > -in
\Windows\run I have > > -rm.exe -f
../../../../resources/install/ windows/config.h echo >
'#define PRODUCTNAME "$(PRODUCTNAME)" '> $(cygwin.target.dir)/config.h
  > echo '#define COMPANYNAME "$(COMPANYNAME)" '>> >
$(cygwin.target.dir)/config.h echo '#define
PRODUCTBUILDVERSION > "$(PRODUCTBUILDVERSION)" '>>
$(cygwin.target.dir)/config.h echo > '#define TARGET_BASENAME
"$(TARGET_BASENAME)"' >> > $(cygwin.target.dir)/config.h
echo '#define TARGET_BASENAME_EXE > "$(TARGET_BASENAME).exe"' >>
$(cygwin.target.dir)/config.h > > > > > in
\Windows\Setup\Cleansweep I have > > -rm.exe -f
../../../../../resources/install/windows/config.h echo > '#define
PRODUCTNAME "$(PRODUCTNAME)" '> $(cygwin.target.dir)/config.h > echo
'#$(DEFINE_PACKAGECODE)' >> $(cygwin.target.dir)/config.h > > > >
   and in \Windows\Setup I have -rm.exe -f
../../../../resources/install/ > windows/config.h echo
'#define PRODUCTNAME "$(PRODUCTNAME)" '> >
$(cygwin.target.dir)/config.h echo '#$(DEFINE_PACKAGECODE)'
>> > $(cygwin.target.dir)/config.h echo
'#$(DEFINE_PACKAGESIZE)' >> > $(cygwin.target.dir)/config.h
echo '#define PRODUCTBUILDVERSION > "$(PRODUCTBUILDVERSION)"' >>
$(cygwin.target.dir)/config.h > > > Hope that helped. > > >
  > > 2015-02-10 14:44 GMT+01:00 ViShNu UnNi
<ampady1987@gmail.com>: > > > Hi, > >
  I installed Cygwin,Mingw and all related tools. I run wix > build and
i got one error.That is > > [mkdir] Created dir: >
E:\Pumex_project\Pharmacy\release\windows\tmp\light [exec] >
makefile:42: *** target pattern contains no `%'. Stop. > >
  BUILD FAILED >
E:\Pumex_project\Pharmacy\resources\install\build.xml:289: The >
following error occurred while executing this line: >
E:\Pumex_project\Pharmacy\resources\install\build.xml:447: exec >
returned: 2 > > > > > > -- > >
Thanks & Regards, > > > Vishnu A U . > > > >
       _______________________________________________ dev mailing list
  > dev@jitsi.org Unsubscribe instructions and
other list options: >
http://lists.jitsi.org/mailman/listinfo/dev > > > > > > --
  > > > _______________________________________________
dev mailing list > dev@jitsi.org Unsubscribe instructions and
other list options: > http://lists.jitsi.org/mailman/listinfo/dev
  > > > > >

  _______________________________________________ dev mailing list
  dev@jitsi.org Unsubscribe instructions and other list options:
  http://lists.jitsi.org/mailman/listinfo/dev


#7

Hi,
Still i have issue...Pls help me to fix this issue."Could not load
definitions from resource net\sf\antcontrib\antlib.xml. It could not be
found." this was the error getting from running the script.

Buildfile: E:\Pumex_project\Pharmacy\build.xml
-pre-version:
version:
    [javac] Compiling 3 source files to E:\Pumex_project\Pharmacy\classes
    [javac] warning: [options] bootstrap class path not set in conjunction
with -source 1.6
    [javac] 1 warning
     [echo] Jitsi version 2.5.0
load-properties:
build-installation-wix:
clean-install-windows:
    [mkdir] Created dir: E:\Pumex_project\Pharmacy\release\windows
    [mkdir] Created dir: E:\Pumex_project\Pharmacy\release\windows\tmp
define-ant-contrib-task:
  [taskdef] Could not load definitions from resource
net\sf\antcontrib\antlib.xml. It could not be found.
build-installation-wix-base:
[propertyfile] Creating new property file:
E:\Pumex_project\Pharmacy\release\windows\versionupdate.properties
    [mkdir] Created dir: E:\Pumex_project\Pharmacy\release\windows\tmp\light
     [exec] process_begin: CreateProcess(NULL, rm.exe -f
..\..\..\..\resources\install\windows\config.h, ...) failed.
     [exec] make (e=2): The system cannot find the file specified.
     [exec] make.exe:
[E:\Pumex_project\Pharmacy\release\windows\tmp\light\config.h] Error 2
(ignored)
     [exec] rm.exe -f ..\..\..\..\resources\install\windows\config.h
     [exec] Makefile:49: recipe for target
'E:\Pumex_project\Pharmacy\release\windows\tmp\light\config.h' failed
     [exec] echo #define PRODUCTNAME "Jitsi" >
E:\Pumex_project\Pharmacy\release\windows\tmp\light\config.h
     [exec] echo #define PRODUCTBUILDVERSION "2.5.0" >>
E:\Pumex_project\Pharmacy\release\windows\tmp\light\config.h
     [exec] echo #define TARGET_BASENAME "Jitsi" >>
E:\Pumex_project\Pharmacy\release\windows\tmp\light\config.h
     [exec] echo #define TARGET_BASENAME_EXE "Jitsi.exe" >>
E:\Pumex_project\Pharmacy\release\windows\tmp\light\config.h
     [exec] echo #define COMPANYNAME "jitsi.org" >>
E:\Pumex_project\Pharmacy\release\windows\tmp\light\config.h
     [exec] C:\MinGW\bin\windres.exe
-I..\..\..\..\resources\install\windows
-IE:\Pumex_project\Pharmacy\release\windows\tmp\light run.rc -O coff -o
E:\Pumex_project\Pharmacy\release\windows\tmp\light\run.res
     [exec] C:\MinGW\bin\gcc.exe -O2 -Wall -Wreturn-type -DPSAPI_VERSION=1
-DWINVER=0x0502 -D_WIN32_WINNT=0x0502
-IE:\Pumex_project\Pharmacy\release\windows\tmp\light -I"C:\Program
Files\Java\jdk1.8.0_05\include" -I"C:\Program
Files\Java\jdk1.8.0_05\include\win32" registry.c run.c
E:\Pumex_project\Pharmacy\release\windows\tmp\light\run.res ..\setup\nls.c
-mwindows -o E:\Pumex_project\Pharmacy\release\windows\tmp\light\Jitsi.exe
-ladvapi32 -lpsapi
     [exec] C:\MinGW\mingw32\bin\strip.exe
E:\Pumex_project\Pharmacy\release\windows\tmp\light\Jitsi.exe
wix-sign-file:
     [copy] Copying 1 file to
E:\Pumex_project\Pharmacy\release\windows\tmp\light
enable-splash:
    [mkdir] Created dir:
E:\Pumex_project\Pharmacy\release\windows\tmp\light\lib
     [copy] Copying 11 files to
E:\Pumex_project\Pharmacy\release\windows\tmp\light\lib
    [mkdir] Created dir:
E:\Pumex_project\Pharmacy\release\windows\tmp\light\lib\bundle
     [copy] Copying 3 files to
E:\Pumex_project\Pharmacy\release\windows\tmp\light\lib\bundle
    [mkdir] Created dir:
E:\Pumex_project\Pharmacy\release\windows\tmp\light\native
     [copy] Copying 25 files to
E:\Pumex_project\Pharmacy\release\windows\tmp\light\native
define-ant-contrib-task:
  [taskdef] Could not load definitions from resource
net\sf\antcontrib\antlib.xml. It could not be found.
wix-sign-dlls:

BUILD FAILED
E:\Pumex_project\Pharmacy\resources\install\build.xml:289: The following
error occurred while executing this line:
E:\Pumex_project\Pharmacy\resources\install\build.xml:517: The following
error occurred while executing this line:
E:\Pumex_project\Pharmacy\resources\install\build.xml:1004: Problem: failed
to create task or type foreach
Cause: The name is undefined.
Action: Check the spelling.
Action: Check that any custom tasks/types have been declared.
Action: Check that any <presetdef>/<macrodef> declarations have taken place.

···

On Wed, Feb 18, 2015 at 4:56 PM, Ingo Bauersachs <ingo@jitsi.org> wrote:

Are you actually building 2.5 sources? If not get your stuff together with
up to date files. Otherwise it probably needs a double build-id as well
(e.g. -Dlabel=0.0)
Then do some research about the content of run.rc on line 33, how it looks
in your file and what windres expects.

Ingo

> -----Original Message-----
> From: dev [mailto:dev-bounces@jitsi.org] On Behalf Of ViShNu UnNi
> Sent: Mittwoch, 18. Februar 2015 12:15
> To: Jitsi Developers
> Subject: Re: [jitsi-dev] I have one problem for making Installer
> Hi,
>
> Still the issue continues......
> Buildfile: E:\Pumex_project\Pharmacy\build.xml
> -pre-version:
> version:
> [javac] Compiling 3 source files to
> E:\Pumex_project\Pharmacy\classes [javac] warning: [options]
> bootstrap class path not set in conjunction with -source 1.6 [javac]
> 1 warning
> [echo] Jitsi version 2.5.0
> load-properties:
> build-installation-wix:
> clean-install-windows:
> [delete] Deleting directory E:\Pumex_project\Pharmacy\release\windows
> [mkdir] Created dir: E:\Pumex_project\Pharmacy\release\windows
> [mkdir] Created dir: E:\Pumex_project\Pharmacy\release\windows\tmp
> define-ant-contrib-task:
> [taskdef] Could not load definitions from resource
> net\sf\antcontrib\antlib.xml. It could not be found.
> build-installation-wix-base: [propertyfile] Creating new property file:
> E:\Pumex_project\Pharmacy\release\windows\versionupdate.properties
> [mkdir] Created dir:
E:\Pumex_project\Pharmacy\release\windows\tmp\light
> [exec] rm.exe -f ..\..\..\..\resources\install\windows\config.h
> [exec] Makefile:49: recipe for target
> 'E:\Pumex_project\Pharmacy\release\windows\tmp\light\config.h'
> failed [exec] process_begin: CreateProcess(NULL, rm.exe -f
> ..\..\..\..\resources\install\windows\config.h, ...) failed. [exec]
> make (e=2): The system cannot find the file specified. [exec]
> make.exe:
> [E:\Pumex_project\Pharmacy\release\windows\tmp\light\config.h] Error 2
> (ignored)
> [exec] echo #define PRODUCTNAME "Jitsi" >
> E:\Pumex_project\Pharmacy\release\windows\tmp\light\config.h [exec]
> echo #define PRODUCTBUILDVERSION "2.5.0" >>
> E:\Pumex_project\Pharmacy\release\windows\tmp\light\config.h [exec]
> echo #define TARGET_BASENAME "Jitsi" >>
> E:\Pumex_project\Pharmacy\release\windows\tmp\light\config.h [exec]
> echo #define TARGET_BASENAME_EXE "Jitsi.exe" >>
> E:\Pumex_project\Pharmacy\release\windows\tmp\light\config.h [exec]
> C:\MinGW\bin\windres.exe -I..\..\..\..\resources\install\windows
> -IE:\Pumex_project\Pharmacy\release\windows\tmp\light run.rc -O coff -o
> E:\Pumex_project\Pharmacy\release\windows\tmp\light\run.res
> [exec] Makefile:56: recipe for target
> 'E:\Pumex_project\Pharmacy\release\windows\tmp\light\run.res'
> failed [exec] C:\MinGW\bin\windres.exe: run.rc:33: syntax error
> [exec] make.exe: ***
> [E:\Pumex_project\Pharmacy\release\windows\tmp\light\run.res] Error 1
>
> BUILD FAILED
> E:\Pumex_project\Pharmacy\resources\install\build.xml:289: The following
> error occurred while executing this line:
> E:\Pumex_project\Pharmacy\resources\install\build.xml:447: exec
returned: 2
>
>
> this is the error getting by running the command Pls help
>
>
> On Wed, Feb 18, 2015 at 3:39 PM, Ingo Bauersachs <ingo@jitsi.org> wrote:
>
>
> "build.by.SVN" or the like don't work in the version number
anymore.
> You need a numeric version. AFAIK that's e.g. ant <target> -Dlabel=123
>
> Ingo
>
>
> > -----Original Message----- > From: dev
> [mailto:dev-bounces@jitsi.org] On Behalf Of ViShNu UnNi > Sent:
> Mittwoch, 18. Februar 2015 10:50 > To: Jitsi Developers > Subject:
Re:
> [jitsi-dev] I have one problem for making Installer > hi , > >
> Thank you Evangelos Nannos.I tried what you >
> suggested, still i got error. > > > >
[propertyfile] Creating new
> property file: >
> E:\Pumex_project\Pharmacy\release\windows\versionupdate.properties >
> [mkdir] Created dir:
> E:\Pumex_project\Pharmacy\release\windows\tmp\light > [exec]
> rm.exe -f ..\..\..\..\resources\install\windows\config.h >
[exec]
> Makefile:49: recipe for target >
> 'E:\Pumex_project\Pharmacy\release\windows\tmp\light\config.h' >
> failed [exec] echo #define PRODUCTNAME "Jitsi" > >
> E:\Pumex_project\Pharmacy\release\windows\tmp\light\config.h [exec] >
> process_begin: CreateProcess(NULL, rm.exe -f >
> ..\..\..\..\resources\install\windows\config.h, ...) failed. [exec] >
> make (e=2): The system cannot find the file specified. [exec] >
> make.exe: >
> [E:\Pumex_project\Pharmacy\release\windows\tmp\light\config.h] Error 2
> > (ignored) > [exec] C:\MinGW\bin\windres.exe -
> I..\..\..\..\resources\install\windows >
> -IE:\Pumex_project\Pharmacy\release\windows\tmp\light run.rc -O coff -o
> > E:\Pumex_project\Pharmacy\release\windows\tmp\light\run.res >
> [exec] Makefile:54: recipe for target >
> 'E:\Pumex_project\Pharmacy\release\windows\tmp\light\run.res' >
> failed [exec] C:\MinGW\bin\windres.exe: run.rc:33: syntax error >
> [exec] make.exe: *** >
> [E:\Pumex_project\Pharmacy\release\windows\tmp\light\run.res] Error 1
     >
> > > > the above error getting while i run command in
mingw. Please
> help > > > On Wed, Feb 11, 2015 at 1:36 AM, Evangelos Nannos
> <enannos@gmail.com> wrote: > > > Hi, >
> make sure that
> in the release/windows/tmp/light/config.h file, you > have something
> like this: > > > #define PRODUCTNAME "Jitsi"
>
> > #define COMPANYNAME "jitsi.org <http://jitsi.org> " >
> #define PRODUCTBUILDVERSION "2.5.0.build.by.SVN" > #define
> TARGET_BASENAME "Jitsi" > #define TARGET_BASENAME_EXE
"Jitsi.exe"
> > <https://ssl.gstatic.com/ui/v1/icons/mail/images/cleardot.gif>
>
> > > If you have some extra single quotes, just remove
them. >
> > > Also, in the makefiles: > >
src\native\windows\setup
> > src\native\windows\setup\cleansweep > >
> src\native\windows\run > > > do what is written
here: >
> http://stackoverflow.com/questions/14495465/installer-for- jitsi-sip-
       >
> communicator > > > It should look like this: >
     -in
> \Windows\run I have > > -rm.exe -f
> ../../../../resources/install/ windows/config.h echo >
> '#define PRODUCTNAME "$(PRODUCTNAME)" '> $(cygwin.target.dir)/config.h
> > echo '#define COMPANYNAME "$(COMPANYNAME)" '>> >
> $(cygwin.target.dir)/config.h echo '#define
> PRODUCTBUILDVERSION > "$(PRODUCTBUILDVERSION)" '>>
> $(cygwin.target.dir)/config.h echo > '#define TARGET_BASENAME
> "$(TARGET_BASENAME)"' >> > $(cygwin.target.dir)/config.h
> echo '#define TARGET_BASENAME_EXE > "$(TARGET_BASENAME).exe"' >>
> $(cygwin.target.dir)/config.h > > > > >
     in
> \Windows\Setup\Cleansweep I have > > -rm.exe -f
> ../../../../../resources/install/windows/config.h echo > '#define
> PRODUCTNAME "$(PRODUCTNAME)" '> $(cygwin.target.dir)/config.h >
  echo
> '#$(DEFINE_PACKAGECODE)' >> $(cygwin.target.dir)/config.h > >
     > >
> and in \Windows\Setup I have -rm.exe -f
> ../../../../resources/install/ > windows/config.h
  echo
> '#define PRODUCTNAME "$(PRODUCTNAME)" '> >
> $(cygwin.target.dir)/config.h echo '#$(DEFINE_PACKAGECODE)'
> >> > $(cygwin.target.dir)/config.h echo
> '#$(DEFINE_PACKAGESIZE)' >> > $(cygwin.target.dir)/config.h
> echo '#define PRODUCTBUILDVERSION > "$(PRODUCTBUILDVERSION)"' >>
> $(cygwin.target.dir)/config.h > > > Hope that
helped. > > >
> > > 2015-02-10 14:44 GMT+01:00 ViShNu UnNi
> <ampady1987@gmail.com>: > > > Hi,
> >
> I installed Cygwin,Mingw and all related tools. I run wix > build and
> i got one error.That is > > [mkdir] Created
dir: >
> E:\Pumex_project\Pharmacy\release\windows\tmp\light [exec] >
> makefile:42: *** target pattern contains no `%'. Stop. > >
> BUILD FAILED >
> E:\Pumex_project\Pharmacy\resources\install\build.xml:289: The >
> following error occurred while executing this line: >
> E:\Pumex_project\Pharmacy\resources\install\build.xml:447: exec >
> returned: 2 > > > > > >
-- > >
> Thanks & Regards, > > > Vishnu A U . >
     > > >
> _______________________________________________ dev mailing list
> > dev@jitsi.org Unsubscribe instructions
and
> other list options: >
> http://lists.jitsi.org/mailman/listinfo/dev > > >
> > > --
> > > >
_______________________________________________
> dev mailing list > dev@jitsi.org Unsubscribe instructions
and
> other list options: >
http://lists.jitsi.org/mailman/listinfo/dev
> > > > > >
>
>
> _______________________________________________ dev
mailing list
> dev@jitsi.org Unsubscribe instructions and other list options:
> http://lists.jitsi.org/mailman/listinfo/dev
>
>
>
>

_______________________________________________
dev mailing list
dev@jitsi.org
Unsubscribe instructions and other list options:
http://lists.jitsi.org/mailman/listinfo/dev

--
Thanks & Regards,

*Vishnu A U* *.*


#8

Hi,
foreach is part of ant-contrib for some reason it cannot find and load
it, you must check whether it exists on the place that the build.xml
is searching for it.

Regards
damencho

···

On Tue, Feb 24, 2015 at 9:22 AM, ViShNu UnNi <ampady1987@gmail.com> wrote:

Hi,
Still i have issue...Pls help me to fix this issue."Could not load
definitions from resource net\sf\antcontrib\antlib.xml. It could not be
found." this was the error getting from running the script.

Buildfile: E:\Pumex_project\Pharmacy\build.xml
-pre-version:
version:
    [javac] Compiling 3 source files to E:\Pumex_project\Pharmacy\classes
    [javac] warning: [options] bootstrap class path not set in conjunction
with -source 1.6
    [javac] 1 warning
     [echo] Jitsi version 2.5.0
load-properties:
build-installation-wix:
clean-install-windows:
    [mkdir] Created dir: E:\Pumex_project\Pharmacy\release\windows
    [mkdir] Created dir: E:\Pumex_project\Pharmacy\release\windows\tmp
define-ant-contrib-task:
  [taskdef] Could not load definitions from resource
net\sf\antcontrib\antlib.xml. It could not be found.
build-installation-wix-base:
[propertyfile] Creating new property file:
E:\Pumex_project\Pharmacy\release\windows\versionupdate.properties
    [mkdir] Created dir: E:\Pumex_project\Pharmacy\release\windows\tmp\light
     [exec] process_begin: CreateProcess(NULL, rm.exe -f
..\..\..\..\resources\install\windows\config.h, ...) failed.
     [exec] make (e=2): The system cannot find the file specified.
     [exec] make.exe:
[E:\Pumex_project\Pharmacy\release\windows\tmp\light\config.h] Error 2
(ignored)
     [exec] rm.exe -f ..\..\..\..\resources\install\windows\config.h
     [exec] Makefile:49: recipe for target
'E:\Pumex_project\Pharmacy\release\windows\tmp\light\config.h' failed
     [exec] echo #define PRODUCTNAME "Jitsi" >
E:\Pumex_project\Pharmacy\release\windows\tmp\light\config.h
     [exec] echo #define PRODUCTBUILDVERSION "2.5.0" >>
E:\Pumex_project\Pharmacy\release\windows\tmp\light\config.h
     [exec] echo #define TARGET_BASENAME "Jitsi" >>
E:\Pumex_project\Pharmacy\release\windows\tmp\light\config.h
     [exec] echo #define TARGET_BASENAME_EXE "Jitsi.exe" >>
E:\Pumex_project\Pharmacy\release\windows\tmp\light\config.h
     [exec] echo #define COMPANYNAME "jitsi.org" >>
E:\Pumex_project\Pharmacy\release\windows\tmp\light\config.h
     [exec] C:\MinGW\bin\windres.exe -I..\..\..\..\resources\install\windows
-IE:\Pumex_project\Pharmacy\release\windows\tmp\light run.rc -O coff -o
E:\Pumex_project\Pharmacy\release\windows\tmp\light\run.res
     [exec] C:\MinGW\bin\gcc.exe -O2 -Wall -Wreturn-type -DPSAPI_VERSION=1
-DWINVER=0x0502 -D_WIN32_WINNT=0x0502
-IE:\Pumex_project\Pharmacy\release\windows\tmp\light -I"C:\Program
Files\Java\jdk1.8.0_05\include" -I"C:\Program
Files\Java\jdk1.8.0_05\include\win32" registry.c run.c
E:\Pumex_project\Pharmacy\release\windows\tmp\light\run.res ..\setup\nls.c
-mwindows -o E:\Pumex_project\Pharmacy\release\windows\tmp\light\Jitsi.exe
-ladvapi32 -lpsapi
     [exec] C:\MinGW\mingw32\bin\strip.exe
E:\Pumex_project\Pharmacy\release\windows\tmp\light\Jitsi.exe
wix-sign-file:
     [copy] Copying 1 file to
E:\Pumex_project\Pharmacy\release\windows\tmp\light
enable-splash:
    [mkdir] Created dir:
E:\Pumex_project\Pharmacy\release\windows\tmp\light\lib
     [copy] Copying 11 files to
E:\Pumex_project\Pharmacy\release\windows\tmp\light\lib
    [mkdir] Created dir:
E:\Pumex_project\Pharmacy\release\windows\tmp\light\lib\bundle
     [copy] Copying 3 files to
E:\Pumex_project\Pharmacy\release\windows\tmp\light\lib\bundle
    [mkdir] Created dir:
E:\Pumex_project\Pharmacy\release\windows\tmp\light\native
     [copy] Copying 25 files to
E:\Pumex_project\Pharmacy\release\windows\tmp\light\native
define-ant-contrib-task:
  [taskdef] Could not load definitions from resource
net\sf\antcontrib\antlib.xml. It could not be found.
wix-sign-dlls:

BUILD FAILED
E:\Pumex_project\Pharmacy\resources\install\build.xml:289: The following
error occurred while executing this line:
E:\Pumex_project\Pharmacy\resources\install\build.xml:517: The following
error occurred while executing this line:
E:\Pumex_project\Pharmacy\resources\install\build.xml:1004: Problem: failed
to create task or type foreach
Cause: The name is undefined.
Action: Check the spelling.
Action: Check that any custom tasks/types have been declared.
Action: Check that any <presetdef>/<macrodef> declarations have taken place.

On Wed, Feb 18, 2015 at 4:56 PM, Ingo Bauersachs <ingo@jitsi.org> wrote:

Are you actually building 2.5 sources? If not get your stuff together with
up to date files. Otherwise it probably needs a double build-id as well
(e.g. -Dlabel=0.0)
Then do some research about the content of run.rc on line 33, how it looks
in your file and what windres expects.

Ingo

> -----Original Message-----
> From: dev [mailto:dev-bounces@jitsi.org] On Behalf Of ViShNu UnNi
> Sent: Mittwoch, 18. Februar 2015 12:15
> To: Jitsi Developers
> Subject: Re: [jitsi-dev] I have one problem for making Installer
> Hi,
>
> Still the issue continues......
> Buildfile: E:\Pumex_project\Pharmacy\build.xml
> -pre-version:
> version:
> [javac] Compiling 3 source files to
> E:\Pumex_project\Pharmacy\classes [javac] warning: [options]
> bootstrap class path not set in conjunction with -source 1.6 [javac]
> 1 warning
> [echo] Jitsi version 2.5.0
> load-properties:
> build-installation-wix:
> clean-install-windows:
> [delete] Deleting directory E:\Pumex_project\Pharmacy\release\windows
> [mkdir] Created dir: E:\Pumex_project\Pharmacy\release\windows
> [mkdir] Created dir: E:\Pumex_project\Pharmacy\release\windows\tmp
> define-ant-contrib-task:
> [taskdef] Could not load definitions from resource
> net\sf\antcontrib\antlib.xml. It could not be found.
> build-installation-wix-base: [propertyfile] Creating new property file:
> E:\Pumex_project\Pharmacy\release\windows\versionupdate.properties
> [mkdir] Created dir:
> E:\Pumex_project\Pharmacy\release\windows\tmp\light
> [exec] rm.exe -f ..\..\..\..\resources\install\windows\config.h
> [exec] Makefile:49: recipe for target
> 'E:\Pumex_project\Pharmacy\release\windows\tmp\light\config.h'
> failed [exec] process_begin: CreateProcess(NULL, rm.exe -f
> ..\..\..\..\resources\install\windows\config.h, ...) failed. [exec]
> make (e=2): The system cannot find the file specified. [exec]
> make.exe:
> [E:\Pumex_project\Pharmacy\release\windows\tmp\light\config.h] Error 2
> (ignored)
> [exec] echo #define PRODUCTNAME "Jitsi" >
> E:\Pumex_project\Pharmacy\release\windows\tmp\light\config.h [exec]
> echo #define PRODUCTBUILDVERSION "2.5.0" >>
> E:\Pumex_project\Pharmacy\release\windows\tmp\light\config.h [exec]
> echo #define TARGET_BASENAME "Jitsi" >>
> E:\Pumex_project\Pharmacy\release\windows\tmp\light\config.h [exec]
> echo #define TARGET_BASENAME_EXE "Jitsi.exe" >>
> E:\Pumex_project\Pharmacy\release\windows\tmp\light\config.h [exec]
> C:\MinGW\bin\windres.exe -I..\..\..\..\resources\install\windows
> -IE:\Pumex_project\Pharmacy\release\windows\tmp\light run.rc -O coff -o
> E:\Pumex_project\Pharmacy\release\windows\tmp\light\run.res
> [exec] Makefile:56: recipe for target
> 'E:\Pumex_project\Pharmacy\release\windows\tmp\light\run.res'
> failed [exec] C:\MinGW\bin\windres.exe: run.rc:33: syntax error
> [exec] make.exe: ***
> [E:\Pumex_project\Pharmacy\release\windows\tmp\light\run.res] Error 1
>
> BUILD FAILED
> E:\Pumex_project\Pharmacy\resources\install\build.xml:289: The following
> error occurred while executing this line:
> E:\Pumex_project\Pharmacy\resources\install\build.xml:447: exec
> returned: 2
>
>
> this is the error getting by running the command Pls help
>
>
> On Wed, Feb 18, 2015 at 3:39 PM, Ingo Bauersachs <ingo@jitsi.org> wrote:
>
>
> "build.by.SVN" or the like don't work in the version number
> anymore.
> You need a numeric version. AFAIK that's e.g. ant <target> -Dlabel=123
>
> Ingo
>
>
> > -----Original Message----- > From: dev
> [mailto:dev-bounces@jitsi.org] On Behalf Of ViShNu UnNi > Sent:
> Mittwoch, 18. Februar 2015 10:50 > To: Jitsi Developers > Subject:
> Re:
> [jitsi-dev] I have one problem for making Installer > hi , > >
> Thank you Evangelos Nannos.I tried what you >
> suggested, still i got error. > > > >
> [propertyfile] Creating new
> property file: >
> E:\Pumex_project\Pharmacy\release\windows\versionupdate.properties >
> [mkdir] Created dir:
> E:\Pumex_project\Pharmacy\release\windows\tmp\light > [exec]
> rm.exe -f ..\..\..\..\resources\install\windows\config.h >
> [exec]
> Makefile:49: recipe for target >
> 'E:\Pumex_project\Pharmacy\release\windows\tmp\light\config.h' >
> failed [exec] echo #define PRODUCTNAME "Jitsi" > >
> E:\Pumex_project\Pharmacy\release\windows\tmp\light\config.h [exec] >
> process_begin: CreateProcess(NULL, rm.exe -f >
> ..\..\..\..\resources\install\windows\config.h, ...) failed. [exec] >
> make (e=2): The system cannot find the file specified. [exec] >
> make.exe: >
> [E:\Pumex_project\Pharmacy\release\windows\tmp\light\config.h] Error 2
> > (ignored) > [exec] C:\MinGW\bin\windres.exe -
> I..\..\..\..\resources\install\windows >
> -IE:\Pumex_project\Pharmacy\release\windows\tmp\light run.rc -O coff -o
> > E:\Pumex_project\Pharmacy\release\windows\tmp\light\run.res >
> [exec] Makefile:54: recipe for target >
> 'E:\Pumex_project\Pharmacy\release\windows\tmp\light\run.res' >
> failed [exec] C:\MinGW\bin\windres.exe: run.rc:33: syntax error >
> [exec] make.exe: *** >
> [E:\Pumex_project\Pharmacy\release\windows\tmp\light\run.res] Error 1
> >
> > > > the above error getting while i run command in
> mingw. Please
> help > > > On Wed, Feb 11, 2015 at 1:36 AM, Evangelos
> Nannos
> <enannos@gmail.com> wrote: > > > Hi, > >
> make sure that
> in the release/windows/tmp/light/config.h file, you > have something
> like this: > > > #define PRODUCTNAME "Jitsi"
>
> > #define COMPANYNAME "jitsi.org <http://jitsi.org> " >
> #define PRODUCTBUILDVERSION "2.5.0.build.by.SVN" > #define
> TARGET_BASENAME "Jitsi" > #define TARGET_BASENAME_EXE
> "Jitsi.exe"
> > <https://ssl.gstatic.com/ui/v1/icons/mail/images/cleardot.gif>
>
> > > If you have some extra single quotes, just remove
> them. >
> > > Also, in the makefiles: > >
> src\native\windows\setup
> > src\native\windows\setup\cleansweep > >
> src\native\windows\run > > > do what is written
> here: >
> http://stackoverflow.com/questions/14495465/installer-for- jitsi-sip-
> >
> communicator > > > It should look like this: >
> -in
> \Windows\run I have > > -rm.exe -f
> ../../../../resources/install/ windows/config.h echo >
> '#define PRODUCTNAME "$(PRODUCTNAME)" '> $(cygwin.target.dir)/config.h
> > echo '#define COMPANYNAME "$(COMPANYNAME)" '>> >
> $(cygwin.target.dir)/config.h echo '#define
> PRODUCTBUILDVERSION > "$(PRODUCTBUILDVERSION)" '>>
> $(cygwin.target.dir)/config.h echo > '#define TARGET_BASENAME
> "$(TARGET_BASENAME)"' >> > $(cygwin.target.dir)/config.h
> echo '#define TARGET_BASENAME_EXE > "$(TARGET_BASENAME).exe"' >>
> $(cygwin.target.dir)/config.h > > > > >
> in
> \Windows\Setup\Cleansweep I have > > -rm.exe -f
> ../../../../../resources/install/windows/config.h echo > '#define
> PRODUCTNAME "$(PRODUCTNAME)" '> $(cygwin.target.dir)/config.h >
> echo
> '#$(DEFINE_PACKAGECODE)' >> $(cygwin.target.dir)/config.h > >
> > >
> and in \Windows\Setup I have -rm.exe -f
> ../../../../resources/install/ > windows/config.h
> echo
> '#define PRODUCTNAME "$(PRODUCTNAME)" '> >
> $(cygwin.target.dir)/config.h echo '#$(DEFINE_PACKAGECODE)'
> >> > $(cygwin.target.dir)/config.h echo
> '#$(DEFINE_PACKAGESIZE)' >> > $(cygwin.target.dir)/config.h
> echo '#define PRODUCTBUILDVERSION > "$(PRODUCTBUILDVERSION)"' >>
> $(cygwin.target.dir)/config.h > > > Hope that
> helped. > > >
> > > 2015-02-10 14:44 GMT+01:00 ViShNu UnNi
> <ampady1987@gmail.com>: > > > Hi, >
> >
> I installed Cygwin,Mingw and all related tools. I run wix > build
> and
> i got one error.That is > > [mkdir] Created
> dir: >
> E:\Pumex_project\Pharmacy\release\windows\tmp\light [exec] >
> makefile:42: *** target pattern contains no `%'. Stop. > >
> BUILD FAILED >
> E:\Pumex_project\Pharmacy\resources\install\build.xml:289: The >
> following error occurred while executing this line: >
> E:\Pumex_project\Pharmacy\resources\install\build.xml:447: exec >
> returned: 2 > > > > > > --
> > >
> Thanks & Regards, > > > Vishnu A U . >
> > > >
> _______________________________________________ dev mailing list
> > dev@jitsi.org Unsubscribe instructions
> and
> other list options: >
> http://lists.jitsi.org/mailman/listinfo/dev > > > >
> > > --
> > > >
> _______________________________________________
> dev mailing list > dev@jitsi.org Unsubscribe instructions
> and
> other list options: >
> http://lists.jitsi.org/mailman/listinfo/dev
> > > > > >
>
>
> _______________________________________________ dev
> mailing list
> dev@jitsi.org Unsubscribe instructions and other list options:
> http://lists.jitsi.org/mailman/listinfo/dev
>
>
>
>

_______________________________________________
dev mailing list
dev@jitsi.org
Unsubscribe instructions and other list options:
http://lists.jitsi.org/mailman/listinfo/dev

--
Thanks & Regards,

Vishnu A U .

_______________________________________________
dev mailing list
dev@jitsi.org
Unsubscribe instructions and other list options:
http://lists.jitsi.org/mailman/listinfo/dev


#9

Hi,
     Now i got another error."Warning: Could not find file
E:\Pumex_project\Pharmacy\resources\install\windowsupdate-location.properties
to copy." this was the error getting from console.

Buildfile: E:\Pumex_project\Pharmacy\build.xml
-pre-version:
version:
    [javac] Compiling 3 source files to E:\Pumex_project\Pharmacy\classes
    [javac] warning: [options] bootstrap class path not set in conjunction
with -source 1.6
    [javac] 1 warning
     [echo] Jitsi version 2.5.0
load-properties:
build-installation-wix:
clean-install-windows:
    [mkdir] Created dir: E:\Pumex_project\Pharmacy\release\windows
    [mkdir] Created dir: E:\Pumex_project\Pharmacy\release\windows\tmp
define-ant-contrib-task:
build-installation-wix-base:
[propertyfile] Creating new property file:
E:\Pumex_project\Pharmacy\release\windows\versionupdate.properties
    [mkdir] Created dir: E:\Pumex_project\Pharmacy\release\windows\tmp\light
     [exec] process_begin: CreateProcess(NULL, rm.exe -f
..\..\..\..\resources\install\windows\config.h, ...) failed.
     [exec] make (e=2): The system cannot find the file specified.
     [exec] make.exe:
[E:\Pumex_project\Pharmacy\release\windows\tmp\light\config.h] Error 2
(ignored)
     [exec] rm.exe -f ..\..\..\..\resources\install\windows\config.h
     [exec] Makefile:49: recipe for target
'E:\Pumex_project\Pharmacy\release\windows\tmp\light\config.h' failed
     [exec] echo #define PRODUCTNAME "Jitsi" >
E:\Pumex_project\Pharmacy\release\windows\tmp\light\config.h
     [exec] echo #define PRODUCTBUILDVERSION "2.5.0" >>
E:\Pumex_project\Pharmacy\release\windows\tmp\light\config.h
     [exec] echo #define TARGET_BASENAME "Jitsi" >>
E:\Pumex_project\Pharmacy\release\windows\tmp\light\config.h
     [exec] echo #define TARGET_BASENAME_EXE "Jitsi.exe" >>
E:\Pumex_project\Pharmacy\release\windows\tmp\light\config.h
     [exec] echo #define COMPANYNAME "jitsi.org" >>
E:\Pumex_project\Pharmacy\release\windows\tmp\light\config.h
     [exec] C:\MinGW\bin\windres.exe
-I..\..\..\..\resources\install\windows
-IE:\Pumex_project\Pharmacy\release\windows\tmp\light run.rc -O coff -o
E:\Pumex_project\Pharmacy\release\windows\tmp\light\run.res
     [exec] C:\MinGW\bin\gcc.exe -O2 -Wall -Wreturn-type -DPSAPI_VERSION=1
-DWINVER=0x0502 -D_WIN32_WINNT=0x0502
-IE:\Pumex_project\Pharmacy\release\windows\tmp\light -I"C:\Program
Files\Java\jdk1.8.0_05\include" -I"C:\Program
Files\Java\jdk1.8.0_05\include\win32" registry.c run.c
E:\Pumex_project\Pharmacy\release\windows\tmp\light\run.res ..\setup\nls.c
-mwindows -o E:\Pumex_project\Pharmacy\release\windows\tmp\light\Jitsi.exe
-ladvapi32 -lpsapi
     [exec] C:\MinGW\mingw32\bin\strip.exe
E:\Pumex_project\Pharmacy\release\windows\tmp\light\Jitsi.exe
wix-sign-file:
     [copy] Copying 1 file to
E:\Pumex_project\Pharmacy\release\windows\tmp\light
enable-splash:
    [mkdir] Created dir:
E:\Pumex_project\Pharmacy\release\windows\tmp\light\lib
     [copy] Copying 11 files to
E:\Pumex_project\Pharmacy\release\windows\tmp\light\lib
    [mkdir] Created dir:
E:\Pumex_project\Pharmacy\release\windows\tmp\light\lib\bundle
     [copy] Copying 3 files to
E:\Pumex_project\Pharmacy\release\windows\tmp\light\lib\bundle
    [mkdir] Created dir:
E:\Pumex_project\Pharmacy\release\windows\tmp\light\native
     [copy] Copying 25 files to
E:\Pumex_project\Pharmacy\release\windows\tmp\light\native
define-ant-contrib-task:
wix-sign-dlls:
wix-sign-file:
wix-sign-file:
wix-sign-file:
wix-sign-file:
wix-sign-file:
wix-sign-file:
wix-sign-file:
wix-sign-file:
wix-sign-file:
wix-sign-file:
wix-sign-file:
wix-sign-file:
wix-sign-file:
wix-sign-file:
wix-sign-file:
wix-sign-file:
wix-sign-file:
wix-sign-file:
wix-sign-file:
wix-sign-file:
    [mkdir] Created dir:
E:\Pumex_project\Pharmacy\release\windows\tmp\light\sc-bundles
     [copy] Copying 145 files to
E:\Pumex_project\Pharmacy\release\windows\tmp\light\sc-bundles
unzip-windows-jre:
    [unzip] Expanding: C:\development\install\jre1.6.0_06.win32.zip into
E:\Pumex_project\Pharmacy\release\windows\tmp\light

BUILD FAILED
E:\Pumex_project\Pharmacy\resources\install\build.xml:289: The following
error occurred while executing this line:
E:\Pumex_project\Pharmacy\resources\install\build.xml:563: Warning: Could
not find file
E:\Pumex_project\Pharmacy\resources\install\windowsupdate-location.properties
to copy.

···

On Tue, Feb 24, 2015 at 12:59 PM, Damian Minkov <damencho@jitsi.org> wrote:

Hi,
foreach is part of ant-contrib for some reason it cannot find and load
it, you must check whether it exists on the place that the build.xml
is searching for it.

Regards
damencho

On Tue, Feb 24, 2015 at 9:22 AM, ViShNu UnNi <ampady1987@gmail.com> wrote:
> Hi,
> Still i have issue...Pls help me to fix this issue."Could not load
> definitions from resource net\sf\antcontrib\antlib.xml. It could not be
> found." this was the error getting from running the script.
>
> Buildfile: E:\Pumex_project\Pharmacy\build.xml
> -pre-version:
> version:
> [javac] Compiling 3 source files to E:\Pumex_project\Pharmacy\classes
> [javac] warning: [options] bootstrap class path not set in
conjunction
> with -source 1.6
> [javac] 1 warning
> [echo] Jitsi version 2.5.0
> load-properties:
> build-installation-wix:
> clean-install-windows:
> [mkdir] Created dir: E:\Pumex_project\Pharmacy\release\windows
> [mkdir] Created dir: E:\Pumex_project\Pharmacy\release\windows\tmp
> define-ant-contrib-task:
> [taskdef] Could not load definitions from resource
> net\sf\antcontrib\antlib.xml. It could not be found.
> build-installation-wix-base:
> [propertyfile] Creating new property file:
> E:\Pumex_project\Pharmacy\release\windows\versionupdate.properties
> [mkdir] Created dir:
E:\Pumex_project\Pharmacy\release\windows\tmp\light
> [exec] process_begin: CreateProcess(NULL, rm.exe -f
> ..\..\..\..\resources\install\windows\config.h, ...) failed.
> [exec] make (e=2): The system cannot find the file specified.
> [exec] make.exe:
> [E:\Pumex_project\Pharmacy\release\windows\tmp\light\config.h] Error 2
> (ignored)
> [exec] rm.exe -f ..\..\..\..\resources\install\windows\config.h
> [exec] Makefile:49: recipe for target
> 'E:\Pumex_project\Pharmacy\release\windows\tmp\light\config.h' failed
> [exec] echo #define PRODUCTNAME "Jitsi" >
> E:\Pumex_project\Pharmacy\release\windows\tmp\light\config.h
> [exec] echo #define PRODUCTBUILDVERSION "2.5.0" >>
> E:\Pumex_project\Pharmacy\release\windows\tmp\light\config.h
> [exec] echo #define TARGET_BASENAME "Jitsi" >>
> E:\Pumex_project\Pharmacy\release\windows\tmp\light\config.h
> [exec] echo #define TARGET_BASENAME_EXE "Jitsi.exe" >>
> E:\Pumex_project\Pharmacy\release\windows\tmp\light\config.h
> [exec] echo #define COMPANYNAME "jitsi.org" >>
> E:\Pumex_project\Pharmacy\release\windows\tmp\light\config.h
> [exec] C:\MinGW\bin\windres.exe
-I..\..\..\..\resources\install\windows
> -IE:\Pumex_project\Pharmacy\release\windows\tmp\light run.rc -O coff -o
> E:\Pumex_project\Pharmacy\release\windows\tmp\light\run.res
> [exec] C:\MinGW\bin\gcc.exe -O2 -Wall -Wreturn-type
-DPSAPI_VERSION=1
> -DWINVER=0x0502 -D_WIN32_WINNT=0x0502
> -IE:\Pumex_project\Pharmacy\release\windows\tmp\light -I"C:\Program
> Files\Java\jdk1.8.0_05\include" -I"C:\Program
> Files\Java\jdk1.8.0_05\include\win32" registry.c run.c
> E:\Pumex_project\Pharmacy\release\windows\tmp\light\run.res
..\setup\nls.c
> -mwindows -o
E:\Pumex_project\Pharmacy\release\windows\tmp\light\Jitsi.exe
> -ladvapi32 -lpsapi
> [exec] C:\MinGW\mingw32\bin\strip.exe
> E:\Pumex_project\Pharmacy\release\windows\tmp\light\Jitsi.exe
> wix-sign-file:
> [copy] Copying 1 file to
> E:\Pumex_project\Pharmacy\release\windows\tmp\light
> enable-splash:
> [mkdir] Created dir:
> E:\Pumex_project\Pharmacy\release\windows\tmp\light\lib
> [copy] Copying 11 files to
> E:\Pumex_project\Pharmacy\release\windows\tmp\light\lib
> [mkdir] Created dir:
> E:\Pumex_project\Pharmacy\release\windows\tmp\light\lib\bundle
> [copy] Copying 3 files to
> E:\Pumex_project\Pharmacy\release\windows\tmp\light\lib\bundle
> [mkdir] Created dir:
> E:\Pumex_project\Pharmacy\release\windows\tmp\light\native
> [copy] Copying 25 files to
> E:\Pumex_project\Pharmacy\release\windows\tmp\light\native
> define-ant-contrib-task:
> [taskdef] Could not load definitions from resource
> net\sf\antcontrib\antlib.xml. It could not be found.
> wix-sign-dlls:
>
> BUILD FAILED
> E:\Pumex_project\Pharmacy\resources\install\build.xml:289: The following
> error occurred while executing this line:
> E:\Pumex_project\Pharmacy\resources\install\build.xml:517: The following
> error occurred while executing this line:
> E:\Pumex_project\Pharmacy\resources\install\build.xml:1004: Problem:
failed
> to create task or type foreach
> Cause: The name is undefined.
> Action: Check the spelling.
> Action: Check that any custom tasks/types have been declared.
> Action: Check that any <presetdef>/<macrodef> declarations have taken
place.
>
> On Wed, Feb 18, 2015 at 4:56 PM, Ingo Bauersachs <ingo@jitsi.org> wrote:
>>
>> Are you actually building 2.5 sources? If not get your stuff together
with
>> up to date files. Otherwise it probably needs a double build-id as well
>> (e.g. -Dlabel=0.0)
>> Then do some research about the content of run.rc on line 33, how it
looks
>> in your file and what windres expects.
>>
>> Ingo
>>
>> > -----Original Message-----
>> > From: dev [mailto:dev-bounces@jitsi.org] On Behalf Of ViShNu UnNi
>> > Sent: Mittwoch, 18. Februar 2015 12:15
>> > To: Jitsi Developers
>> > Subject: Re: [jitsi-dev] I have one problem for making Installer
>> > Hi,
>> >
>> > Still the issue continues......
>> > Buildfile: E:\Pumex_project\Pharmacy\build.xml
>> > -pre-version:
>> > version:
>> > [javac] Compiling 3 source files to
>> > E:\Pumex_project\Pharmacy\classes [javac] warning: [options]
>> > bootstrap class path not set in conjunction with -source 1.6
[javac]
>> > 1 warning
>> > [echo] Jitsi version 2.5.0
>> > load-properties:
>> > build-installation-wix:
>> > clean-install-windows:
>> > [delete] Deleting directory
E:\Pumex_project\Pharmacy\release\windows
>> > [mkdir] Created dir: E:\Pumex_project\Pharmacy\release\windows
>> > [mkdir] Created dir: E:\Pumex_project\Pharmacy\release\windows\tmp
>> > define-ant-contrib-task:
>> > [taskdef] Could not load definitions from resource
>> > net\sf\antcontrib\antlib.xml. It could not be found.
>> > build-installation-wix-base: [propertyfile] Creating new property
file:
>> > E:\Pumex_project\Pharmacy\release\windows\versionupdate.properties
>> > [mkdir] Created dir:
>> > E:\Pumex_project\Pharmacy\release\windows\tmp\light
>> > [exec] rm.exe -f ..\..\..\..\resources\install\windows\config.h
>> > [exec] Makefile:49: recipe for target
>> > 'E:\Pumex_project\Pharmacy\release\windows\tmp\light\config.h'
>> > failed [exec] process_begin: CreateProcess(NULL, rm.exe -f
>> > ..\..\..\..\resources\install\windows\config.h, ...) failed.
[exec]
>> > make (e=2): The system cannot find the file specified. [exec]
>> > make.exe:
>> > [E:\Pumex_project\Pharmacy\release\windows\tmp\light\config.h] Error 2
>> > (ignored)
>> > [exec] echo #define PRODUCTNAME "Jitsi" >
>> > E:\Pumex_project\Pharmacy\release\windows\tmp\light\config.h
[exec]
>> > echo #define PRODUCTBUILDVERSION "2.5.0" >>
>> > E:\Pumex_project\Pharmacy\release\windows\tmp\light\config.h
[exec]
>> > echo #define TARGET_BASENAME "Jitsi" >>
>> > E:\Pumex_project\Pharmacy\release\windows\tmp\light\config.h
[exec]
>> > echo #define TARGET_BASENAME_EXE "Jitsi.exe" >>
>> > E:\Pumex_project\Pharmacy\release\windows\tmp\light\config.h
[exec]
>> > C:\MinGW\bin\windres.exe -I..\..\..\..\resources\install\windows
>> > -IE:\Pumex_project\Pharmacy\release\windows\tmp\light run.rc -O coff
-o
>> > E:\Pumex_project\Pharmacy\release\windows\tmp\light\run.res
>> > [exec] Makefile:56: recipe for target
>> > 'E:\Pumex_project\Pharmacy\release\windows\tmp\light\run.res'
>> > failed [exec] C:\MinGW\bin\windres.exe: run.rc:33: syntax error
>> > [exec] make.exe: ***
>> > [E:\Pumex_project\Pharmacy\release\windows\tmp\light\run.res] Error 1
>> >
>> > BUILD FAILED
>> > E:\Pumex_project\Pharmacy\resources\install\build.xml:289: The
following
>> > error occurred while executing this line:
>> > E:\Pumex_project\Pharmacy\resources\install\build.xml:447: exec
>> > returned: 2
>> >
>> >
>> > this is the error getting by running the command Pls help
>> >
>> >
>> > On Wed, Feb 18, 2015 at 3:39 PM, Ingo Bauersachs <ingo@jitsi.org> > wrote:
>> >
>> >
>> > "build.by.SVN" or the like don't work in the version number
>> > anymore.
>> > You need a numeric version. AFAIK that's e.g. ant <target> -Dlabel=123
>> >
>> > Ingo
>> >
>> >
>> > > -----Original Message----- > From: dev
>> > [mailto:dev-bounces@jitsi.org] On Behalf Of ViShNu UnNi > Sent:
>> > Mittwoch, 18. Februar 2015 10:50 > To: Jitsi Developers >
Subject:
>> > Re:
>> > [jitsi-dev] I have one problem for making Installer > hi , >
>
>> > Thank you Evangelos Nannos.I tried what you
>
>> > suggested, still i got error. > > > >
>> > [propertyfile] Creating new
>> > property file: >
>> > E:\Pumex_project\Pharmacy\release\windows\versionupdate.properties
>
>> > [mkdir] Created dir:
>> > E:\Pumex_project\Pharmacy\release\windows\tmp\light > [exec]
>> > rm.exe -f ..\..\..\..\resources\install\windows\config.h >
>> > [exec]
>> > Makefile:49: recipe for target >
>> > 'E:\Pumex_project\Pharmacy\release\windows\tmp\light\config.h'
>
>> > failed [exec] echo #define PRODUCTNAME "Jitsi" > >
>> > E:\Pumex_project\Pharmacy\release\windows\tmp\light\config.h [exec]
>
>> > process_begin: CreateProcess(NULL, rm.exe -f >
>> > ..\..\..\..\resources\install\windows\config.h, ...) failed. [exec]
>
>> > make (e=2): The system cannot find the file specified. [exec]
>
>> > make.exe: >
>> > [E:\Pumex_project\Pharmacy\release\windows\tmp\light\config.h] Error 2
>> > > (ignored) > [exec] C:\MinGW\bin\windres.exe -
>> > I..\..\..\..\resources\install\windows >
>> > -IE:\Pumex_project\Pharmacy\release\windows\tmp\light run.rc -O coff
-o
>> > > E:\Pumex_project\Pharmacy\release\windows\tmp\light\run.res
>
>> > [exec] Makefile:54: recipe for target >
>> > 'E:\Pumex_project\Pharmacy\release\windows\tmp\light\run.res'
>
>> > failed [exec] C:\MinGW\bin\windres.exe: run.rc:33: syntax error
>
>> > [exec] make.exe: *** >
>> > [E:\Pumex_project\Pharmacy\release\windows\tmp\light\run.res] Error 1
>> > >
>> > > > > the above error getting while i run command in
>> > mingw. Please
>> > help > > > On Wed, Feb 11, 2015 at 1:36 AM, Evangelos
>> > Nannos
>> > <enannos@gmail.com> wrote: > > > Hi, >
>
>> > make sure that
>> > in the release/windows/tmp/light/config.h file, you > have something
>> > like this: > > > #define PRODUCTNAME "Jitsi"
>> >
>> > > #define COMPANYNAME "jitsi.org <http://jitsi.org> "
>
>> > #define PRODUCTBUILDVERSION "2.5.0.build.by.SVN" > #define
>> > TARGET_BASENAME "Jitsi" > #define TARGET_BASENAME_EXE
>> > "Jitsi.exe"
>> > > <https://ssl.gstatic.com/ui/v1/icons/mail/images/cleardot.gif
>
>> >
>> > > > If you have some extra single quotes, just
remove
>> > them. >
>> > > > Also, in the makefiles: > >
>> > src\native\windows\setup
>> > > src\native\windows\setup\cleansweep > >
>> > src\native\windows\run > > > do what is
written
>> > here: >
>> > http://stackoverflow.com/questions/14495465/installer-for- jitsi-sip-
>> > >
>> > communicator > > > It should look like this:
>
>> > -in
>> > \Windows\run I have > > -rm.exe -f
>> > ../../../../resources/install/ windows/config.h echo
>
>> > '#define PRODUCTNAME "$(PRODUCTNAME)" '> $(cygwin.target.dir)/config.h
>> > > echo '#define COMPANYNAME "$(COMPANYNAME)" '>> >
>> > $(cygwin.target.dir)/config.h echo '#define
>> > PRODUCTBUILDVERSION > "$(PRODUCTBUILDVERSION)" '>>
>> > $(cygwin.target.dir)/config.h echo > '#define TARGET_BASENAME
>> > "$(TARGET_BASENAME)"' >> > $(cygwin.target.dir)/config.h
>> > echo '#define TARGET_BASENAME_EXE > "$(TARGET_BASENAME).exe"' >>
>> > $(cygwin.target.dir)/config.h > > > >
>
>> > in
>> > \Windows\Setup\Cleansweep I have > > -rm.exe -f
>> > ../../../../../resources/install/windows/config.h echo >
'#define
>> > PRODUCTNAME "$(PRODUCTNAME)" '> $(cygwin.target.dir)/config.h
>
>> > echo
>> > '#$(DEFINE_PACKAGECODE)' >> $(cygwin.target.dir)/config.h >
>
>> > > >
>> > and in \Windows\Setup I have -rm.exe -f
>> > ../../../../resources/install/ > windows/config.h
>> > echo
>> > '#define PRODUCTNAME "$(PRODUCTNAME)" '> >
>> > $(cygwin.target.dir)/config.h echo
'#$(DEFINE_PACKAGECODE)'
>> > >> > $(cygwin.target.dir)/config.h echo
>> > '#$(DEFINE_PACKAGESIZE)' >> > $(cygwin.target.dir)/config.h
>> > echo '#define PRODUCTBUILDVERSION > "$(PRODUCTBUILDVERSION)"' >>
>> > $(cygwin.target.dir)/config.h > > > Hope
that
>> > helped. > > >
>> > > > 2015-02-10 14:44 GMT+01:00 ViShNu UnNi
>> > <ampady1987@gmail.com>: > > > Hi,
>
>> > >
>> > I installed Cygwin,Mingw and all related tools. I run wix > build
>> > and
>> > i got one error.That is > > [mkdir] Created
>> > dir: >
>> > E:\Pumex_project\Pharmacy\release\windows\tmp\light [exec] >
>> > makefile:42: *** target pattern contains no `%'. Stop. >
>
>> > BUILD FAILED >
>> > E:\Pumex_project\Pharmacy\resources\install\build.xml:289: The
>
>> > following error occurred while executing this line: >
>> > E:\Pumex_project\Pharmacy\resources\install\build.xml:447: exec
>
>> > returned: 2 > > > > > >
--
>> > > >
>> > Thanks & Regards, > > > Vishnu A U .
>
>> > > > >
>> > _______________________________________________ dev mailing
list
>> > > dev@jitsi.org Unsubscribe
instructions
>> > and
>> > other list options: >
>> > http://lists.jitsi.org/mailman/listinfo/dev > > >
>
>> > > > --
>> > > > >
>> > _______________________________________________
>> > dev mailing list > dev@jitsi.org Unsubscribe
instructions
>> > and
>> > other list options: >
>> > http://lists.jitsi.org/mailman/listinfo/dev
>> > > > > > >
>> >
>> >
>> > _______________________________________________ dev
>> > mailing list
>> > dev@jitsi.org Unsubscribe instructions and other list
options:
>> > http://lists.jitsi.org/mailman/listinfo/dev
>> >
>> >
>> >
>> >
>>
>>
>> _______________________________________________
>> dev mailing list
>> dev@jitsi.org
>> Unsubscribe instructions and other list options:
>> http://lists.jitsi.org/mailman/listinfo/dev
>
>
>
>
> --
> Thanks & Regards,
>
> Vishnu A U .
>
>
> _______________________________________________
> dev mailing list
> dev@jitsi.org
> Unsubscribe instructions and other list options:
> http://lists.jitsi.org/mailman/listinfo/dev

_______________________________________________
dev mailing list
dev@jitsi.org
Unsubscribe instructions and other list options:
http://lists.jitsi.org/mailman/listinfo/dev

--
Thanks & Regards,

*Vishnu A U* *.*


#10

Not sure what is wrong with your paths but the file is:
E:\Pumex_project\Pharmacy\resources\install\windows\update-location.properties

···

On Tue, Feb 24, 2015 at 11:56 AM, ViShNu UnNi <ampady1987@gmail.com> wrote:

E:\Pumex_project\Pharmacy\resources\install\windowsupdate-location.properties


#11

Hi,
    Still getting the error...

[mkdir] Created dir:
E:\Pumex_project\Pharmacy\release\windows\tmp\light\sc-bundles
     [copy] Copying 145 files to
E:\Pumex_project\Pharmacy\release\windows\tmp\light\sc-bundles
unzip-windows-jre:
    [unzip] Expanding: C:\development\install\jre1.6.0_06.win32.zip into
E:\Pumex_project\Pharmacy\release\windows\tmp\light
     [copy] Copying 1 file to
E:\Pumex_project\Pharmacy\release\windows\tmp\light
     [copy] Copying 1 file to E:\Pumex_project\Pharmacy\release\windows\tmp
build-installation-wix-msi:
     [move] Warning: Could not find file
E:\Pumex_project\Pharmacy\release\windows\tmp\setup.msi to copy.
build-installation-wix-msi:
     [copy] Copying 5 files to E:\Pumex_project\Pharmacy\release\windows\tmp
     [exec] installer-windows.wxs
     [exec]
E:\Pumex_project\Pharmacy\release\windows\tmp\installer-windows.wxs(67) :
error CNDL0103 : The system cannot find the file 'component-defines.wxi '
with type 'include'.

BUILD FAILED
E:\Pumex_project\Pharmacy\resources\install\build.xml:289: The following
error occurred while executing this line:
E:\Pumex_project\Pharmacy\resources\install\build.xml:680: The following
error occurred while executing this line:
E:\Pumex_project\Pharmacy\resources\install\build.xml:760: exec returned:
103

···

On Tue, Feb 24, 2015 at 3:35 PM, Damian Minkov <damencho@jitsi.org> wrote:

On Tue, Feb 24, 2015 at 11:56 AM, ViShNu UnNi <ampady1987@gmail.com> > wrote:
>
E:\Pumex_project\Pharmacy\resources\install\windowsupdate-location.properties

Not sure what is wrong with your paths but the file is:

E:\Pumex_project\Pharmacy\resources\install\windows\update-location.properties

_______________________________________________
dev mailing list
dev@jitsi.org
Unsubscribe instructions and other list options:
http://lists.jitsi.org/mailman/listinfo/dev

--
Thanks & Regards,

*Vishnu A U* *.*