Facing issue while running make command on server

below error I am getting when running make after npm install in serverside.
cp
node_modules/lib-jitsi-meet//lib-jitsi-meet.min.js
node_modules/lib-jitsi-meet//lib-jitsi-meet.min.map
node_modules/lib-jitsi-meet//lib-jitsi-meet.e2ee-worker.js
node_modules/lib-jitsi-meet//connection_optimization/external_connect.js
node_modules/lib-jitsi-meet//modules/browser/capabilities.json
libs
cp: cannot stat ‘node_modules/lib-jitsi-meet//lib-jitsi-meet.min.js’: No such file or directory
cp: cannot stat ‘node_modules/lib-jitsi-meet//lib-jitsi-meet.min.map’: No such file or directory
cp: cannot stat ‘node_modules/lib-jitsi-meet//lib-jitsi-meet.e2ee-worker.js’: No such file or directory
Makefile:60: recipe for target ‘deploy-lib-jitsi-meet’ failed
make: *** [deploy-lib-jitsi-meet] Error 1

please give any suggestions

Did npm install passed with no errors?

Yes npm passed with no erros with below message
found 1427 vulnerabilities (1425 low, 2 high)
run npm audit fix to fix them, or npm audit for details

and after running make below output is coming

./node_modules/.bin/webpack -p
Browserslist: caniuse-lite is outdated. Please run next command npm update
Hash: 9041ed5447593b2eedae99da6118994d5afa65f370a55d7925fad22941a7b608064eb454eea558f483554645f4a012eb13d2338e11933c93a0c8e11a1062cb4819f6c812478d942244a88d1fffdbdcb9dc7862dc32c557b8eff548344b56455213e8b0bea53a85a5b01aee32a0f6
Version: webpack 4.43.0
Child
Hash: 9041ed5447593b2eedae
Time: 106702ms
Built at: 10/02/2020 1:26:14 PM
Asset Size Chunks Chunk Names
app.bundle.min.js 3.68 MiB 0 [emitted] app.bundle
app.bundle.min.map 11.1 MiB 0 [emitted] [dev] app.bundle
Entrypoint app.bundle = app.bundle.min.js app.bundle.min.map
[5] ./react/features/base/lib-jitsi-meet/index.js 1.42 KiB {0} [built]
[6] ./react/features/analytics/index.js 63 bytes {0} [built]
[7] ./react/features/base/i18n/index.js + 28 modules 88.7 KiB {0} [built]
| ./react/features/base/i18n/index.js 261 bytes [built]
| ./react/features/base/i18n/i18next.js 2.09 KiB [built]
| ./react/features/base/i18n/dateUtil.js 2.83 KiB [built]
| ./react/features/base/i18n/languageDetector.web.js 1.13 KiB [built]
| ./react/features/base/i18n/configLanguageDetector.js 455 bytes [built]
| ./react/features/base/i18n/customNavigatorDetector.js 1.02 KiB [built]
| + 23 hidden modules
[11] ./react/features/base/participants/index.js + 1 modules 233 bytes {0} [built]
| ./react/features/base/participants/index.js 145 bytes [built]
| + 1 hidden module
[20] ./react/features/base/conference/index.js 115 bytes {0} [built]
[26] ./react/features/base/util/index.js + 6 modules 19.6 KiB {0} [built]
| ./react/features/base/util/index.js 178 bytes [built]
| ./react/features/base/util/httpUtils.js 1.06 KiB [built]
| ./react/features/base/util/loadScript.web.js 555 bytes [built]
| ./react/features/base/util/openURLInBrowser.web.js 326 bytes [built]
| ./react/features/base/util/uri.js 16.2 KiB [built]
| ./react/features/base/util/timeoutPromise.js 1.06 KiB [built]
| ./react/features/base/util/strings.web.js 240 bytes [built]
[27] ./react/features/base/dialog/index.js + 87 modules 195 KiB {0} [built]
| ./react/features/base/dialog/index.js 116 bytes [built]
| ./react/features/base/dialog/logger.js 99 bytes [built]
| ./react/features/base/util/react-focus-lock-wrapper.js 2.5 KiB [built]
| + 85 hidden modules
[29] ./react/features/base/tracks/index.js 86 bytes {0} [built]
[30] ./react/features/base/media/index.js + 6 modules 7.35 KiB {0} [built]
| ./react/features/base/media/index.js 145 bytes [built]
| ./react/features/base/media/functions.js 2.28 KiB [built]
| + 5 hidden modules
[33] ./react/features/base/react/index.js 133 bytes {0} [built]
[643] ./conference.js 93 KiB {0} [built]
[704] ./modules/UI/UI.js 15.8 KiB {0} [built]
[706] ./modules/keyboardshortcut/keyboardshortcut.js 6.18 KiB {0} [built]
[707] ./modules/remotecontrol/RemoteControl.js 2.33 KiB {0} [built]
[950] ./app.js + 258 modules 560 KiB {0} [built]
| ./app.js 1.64 KiB [built]
| ./modules/API/index.js 90 bytes [built]
| ./modules/translation/translation.js 1.15 KiB [built]
| ./react/index.web.js 2.12 KiB [built]
| ./react/features/chrome-extension-banner/index.js 29 bytes [built]
| ./react/features/app/middlewares.web.js 489 bytes [built]
| ./react/features/app/reducers.web.js 401 bytes [built]
| ./react/features/base/devices/middleware.js 9.95 KiB [built]
| ./react/features/e2ee/middleware.js 1.41 KiB [built]
| ./react/features/external-api/middleware.js 5.08 KiB [built]
| ./react/features/keyboard-shortcuts/middleware.js 557 bytes [built]
| ./react/features/local-recording/middleware.js 3.15 KiB [built]
| ./react/features/no-audio-signal/middleware.js 4.56 KiB [built]
| ./react/features/noise-detection/middleware.js 2.09 KiB [built]
| ./react/features/old-client-notification/middleware.js 1.31 KiB [built]
| + 244 hidden modules
+ 1060 hidden modules
Child
Hash: 99da6118994d5afa65f3
Time: 68295ms
Built at: 10/02/2020 1:25:35 PM
Asset Size Chunks Chunk Names
device_selection_popup_bundle.min.js 706 KiB 0 [emitted] device_selection_popup_bundle
device_selection_popup_bundle.min.map 2.81 MiB 0 [emitted] [dev] device_selection_popup_bundle
Entrypoint device_selection_popup_bundle = device_selection_popup_bundle.min.js device_selection_popup_bundle.min.map
[4] ./node_modules/@atlaskit/modal-dialog/node_modules/@atlaskit/theme/index.js + 9 modules 13.5 KiB {0} [built]
| 10 modules
[5] ./node_modules/@atlaskit/dropdown-menu/node_modules/@atlaskit/theme/dist/esm/index.js + 10 modules 22.1 KiB {0} [built]
| 11 modules
[25] ./react/features/base/lib-jitsi-meet/_.web.js 27 bytes {0} [built]
[28] ./modules/API/external/functions.js 3.96 KiB {0} [built]
[35] (webpack)/buildin/global.js 472 bytes {0} [built]
[92] ./node_modules/@atlaskit/theme/dist/esm/index.js + 13 modules 23.5 KiB {0} [built]
| 14 modules
[93] ./react/features/base/logging/LogTransport.web.js 0 bytes {0} [built]
[104] (webpack)/buildin/harmony-module.js 573 bytes {0} [built]
[113] (webpack)/buildin/amd-options.js 80 bytes {0} [built]
[194] (webpack)/buildin/module.js 497 bytes {0} [built]
[270] ./react/features/settings/popup.js + 287 modules 719 KiB {0} [built]
| ./react/features/settings/popup.js 315 bytes [built]
| ./react/features/base/util/parseURLParams.js 1.46 KiB [built]
| ./modules/transport/index.js 1.27 KiB [built]
| ./react/features/base/util/helpers.js 2.93 KiB [built]
| ./react/features/base/util/index.js 178 bytes [built]
| ./modules/API/constants.js 768 bytes [built]
| ./react/features/base/i18n/functions.js 1.04 KiB [built]
| ./react/features/base/dialog/logger.js 99 bytes [built]
| ./react/features/base/lib-jitsi-meet/functions.web.js 461 bytes [built]
| ./react/features/device-selection/logger.js 109 bytes [built]
| ./react/features/base/util/httpUtils.js 1.06 KiB [built]
| ./react/features/base/util/loadScript.web.js 555 bytes [built]
| ./react/features/base/util/openURLInBrowser.web.js 326 bytes [built]
| ./react/features/base/util/uri.js 16.2 KiB [built]
| ./react/features/base/logging/functions.js 1.22 KiB [built]
| + 273 hidden modules
+ 313 hidden modules
Child
Hash: 70a55d7925fad22941a7
Time: 68278ms
Built at: 10/02/2020 1:25:35 PM
Asset Size Chunks Chunk Names
alwaysontop.min.js 354 KiB 0 [emitted] alwaysontop
alwaysontop.min.map 1.65 MiB 0 [emitted] [dev] alwaysontop
Entrypoint alwaysontop = alwaysontop.min.js alwaysontop.min.map
[37] (webpack)/buildin/global.js 472 bytes {0} [built]
[94] (webpack)/buildin/module.js 497 bytes {0} [built]
[149] (webpack)/buildin/harmony-module.js 573 bytes {0} [built]
[157] ./react/features/always-on-top/index.js + 157 modules 209 KiB {0} [built]
| ./react/features/always-on-top/index.js 364 bytes [built]
| ./react/features/always-on-top/AlwaysOnTop.js 5.82 KiB [built]
| ./react/features/base/avatar/functions.js 1.07 KiB [built]
| ./react/features/always-on-top/Toolbar.js 915 bytes [built]
| ./react/features/base/icons/index.js 52 bytes [built]
| ./react/features/always-on-top/AudioMuteButton.js 3.2 KiB [built]
| ./react/features/always-on-top/HangupButton.js 931 bytes [built]
| ./react/features/always-on-top/VideoMuteButton.js 3.2 KiB [built]
| ./react/features/base/icons/svg/index.js 6.03 KiB [built]
| ./react/features/base/icons/svg/add.svg 636 bytes [built]
| ./react/features/base/icons/svg/link.svg 826 bytes [built]
| ./react/features/base/icons/svg/arrow_back.svg 691 bytes [built]
| ./react/features/base/icons/svg/arrow_down.svg 750 bytes [built]
| ./react/features/base/icons/svg/arrow-down-small.svg 806 bytes [built]
| ./react/features/base/icons/svg/arrow-left.svg 793 bytes [built]
| + 143 hidden modules
+ 160 hidden modules
Child
Hash: b608064eb454eea558f4
Time: 31138ms
Built at: 10/02/2020 1:24:58 PM
Asset Size Chunks Chunk Names
dial_in_info_bundle.min.js 484 KiB 0 [emitted] dial_in_info_bundle
dial_in_info_bundle.min.map 1.31 MiB 0 [emitted] [dev] dial_in_info_bundle
Entrypoint dial_in_info_bundle = dial_in_info_bundle.min.js dial_in_info_bundle.min.map
[24] ./lang/languages.json 1.02 KiB {0} [built]
[131] ./lang/main.json 48.7 KiB {0} [built]
[146] (webpack)/buildin/module.js 497 bytes {0} [built]
[147] ./node_modules/moment/locale sync ^./.*$ 2.79 KiB {0} [optional] [built]
[157] ./react/features/base/i18n/BuiltinLanguages.web.js 0 bytes {0} [built]
[159] ./react/features/invite/components/dial-in-info-page/index.js + 59 modules 154 KiB {0} [built]
| ./react/features/base/environment/utils.js 982 bytes [built]
| ./react/features/base/i18n/index.js 261 bytes [built]
| ./react/features/base/util/parseURLParams.js 1.46 KiB [built]
| ./react/features/base/react/Platform.web.js 743 bytes [built]
| ./react/features/base/i18n/i18next.js 2.09 KiB [built]
| ./react/features/base/i18n/dateUtil.js 2.83 KiB [built]
| ./react/features/base/i18n/functions.js 1.04 KiB [built]
| ./react/features/base/util/helpers.js 2.93 KiB [built]
| ./react/features/base/i18n/languageDetector.web.js 1.13 KiB [built]
| ./react/features/base/i18n/configLanguageDetector.js 455 bytes [built]
| ./react/features/base/i18n/customNavigatorDetector.js 1.02 KiB [built]
| ./react/features/base/util/index.js 178 bytes [built]
| ./react/features/base/util/httpUtils.js 1.06 KiB [built]
| ./react/features/base/util/loadScript.web.js 555 bytes [built]
| ./react/features/base/util/openURLInBrowser.web.js 326 bytes [built]
| + 45 hidden modules
+ 154 hidden modules
Child
Hash: 83554645f4a012eb13d2
Time: 12044ms
Built at: 10/02/2020 1:24:39 PM
Asset Size Chunks Chunk Names
do_external_connect.min.js 2.35 KiB 0 [emitted] do_external_connect
do_external_connect.min.map 33 KiB 0 [emitted] [dev] do_external_connect
Entrypoint do_external_connect = do_external_connect.min.js do_external_connect.min.map
[0] ./connection_optimization/do_external_connect.js + 10 modules 26.8 KiB {0} [built]
| ./connection_optimization/do_external_connect.js 2.41 KiB [built]
| ./react/features/base/util/parseURLParams.js 1.46 KiB [built]
| ./react/features/base/config/getRoomName.js 389 bytes [built]
| ./react/features/base/util/helpers.js 2.93 KiB [built]
| ./react/features/base/util/index.js 178 bytes [built]
| ./react/features/base/util/httpUtils.js 1.06 KiB [built]
| ./react/features/base/util/loadScript.web.js 555 bytes [built]
| ./react/features/base/util/openURLInBrowser.web.js 326 bytes [built]
| ./react/features/base/util/uri.js 16.2 KiB [built]
| ./react/features/base/util/timeoutPromise.js 1.06 KiB [built]
| ./react/features/base/util/strings.web.js 240 bytes [built]
Child
Hash: 338e11933c93a0c8e11a
Time: 7205ms
Built at: 10/02/2020 1:24:34 PM
Asset Size Chunks Chunk Names
flacEncodeWorker.min.js 3.93 KiB 0 [emitted] flacEncodeWorker
flacEncodeWorker.min.map 19.3 KiB 0 [emitted] [dev] flacEncodeWorker
Entrypoint flacEncodeWorker = flacEncodeWorker.min.js flacEncodeWorker.min.map
[0] ./react/features/local-recording/recording/flac/flacEncodeWorker.js + 1 modules 10.1 KiB {0} [built]
| ./react/features/local-recording/recording/flac/flacEncodeWorker.js 9.03 KiB [built]
| ./react/features/local-recording/recording/flac/messageTypes.js 1.05 KiB [built]
Child
Hash: 1062cb4819f6c812478d
Time: 10377ms
Built at: 10/02/2020 1:24:37 PM
Asset Size Chunks Chunk Names
analytics-ga.min.js 3.08 KiB 0 [emitted] analytics-ga
analytics-ga.min.map 18 KiB 0 [emitted] [dev] analytics-ga
Entrypoint analytics-ga = analytics-ga.min.js analytics-ga.min.map
[0] ./react/features/analytics/handlers/GoogleAnalyticsHandler.js + 10 modules 30.5 KiB {0} [built]
| ./react/features/analytics/handlers/GoogleAnalyticsHandler.js 4.18 KiB [built]
| ./react/features/base/util/index.js 178 bytes [built]
| ./react/features/analytics/handlers/AbstractHandler.js 2.35 KiB [built]
| ./react/features/base/util/helpers.js 2.93 KiB [built]
| ./react/features/base/util/httpUtils.js 1.06 KiB [built]
| ./react/features/base/util/loadScript.web.js 555 bytes [built]
| ./react/features/base/util/openURLInBrowser.web.js 326 bytes [built]
| ./react/features/base/util/parseURLParams.js 1.46 KiB [built]
| ./react/features/base/util/uri.js 16.2 KiB [built]
| ./react/features/base/util/timeoutPromise.js 1.06 KiB [built]
| ./react/features/base/util/strings.web.js 240 bytes [built]
Child
Hash: 942244a88d1fffdbdcb9
Time: 5965ms
Built at: 10/02/2020 1:24:33 PM
Asset Size Chunks Chunk Names
close3.min.js 972 bytes 0 [emitted] close3
close3.min.map 4.53 KiB 0 [emitted] [dev] close3
Entrypoint close3 = close3.min.js close3.min.map
[0] ./static/close3.js 0 bytes {0} [built]
Child
Hash: dc7862dc32c557b8eff5
Time: 29238ms
Built at: 10/02/2020 1:24:56 PM
Asset Size Chunks Chunk Names
video-blur-effect.min.js 690 KiB 0 [emitted] video-blur-effect
video-blur-effect.min.map 1.51 MiB 0 [emitted] [dev] video-blur-effect
Entrypoint video-blur-effect = video-blur-effect.min.js video-blur-effect.min.map
[1] (webpack)/buildin/global.js 472 bytes {0} [built]
[10] crypto (ignored) 15 bytes {0} [optional] [built]
[11] node-fetch (ignored) 15 bytes {0} [built]
[12] util (ignored) 15 bytes {0} [built]
[13] ./react/features/stream-effects/blur/index.js + 4 modules 67.2 KiB {0} [built]
| ./react/features/stream-effects/blur/index.js 810 bytes [built]
| ./react/features/stream-effects/blur/JitsiStreamBlurEffect.js 5.12 KiB [built]
| ./react/features/stream-effects/blur/TimerWorker.js 1.37 KiB [built]
| + 2 hidden modules
+ 9 hidden modules
Child
Hash: 48344b56455213e8b0be
Time: 9650ms
Built at: 10/02/2020 1:24:37 PM
Asset Size Chunks Chunk Names
rnnoise-processor.min.js 9.75 KiB 0 [emitted] rnnoise-processor
rnnoise-processor.min.map 40.5 KiB 0 [emitted] [dev] rnnoise-processor
Entrypoint rnnoise-processor = rnnoise-processor.min.js rnnoise-processor.min.map
[2] ./react/features/stream-effects/rnnoise/index.js + 1 modules 6.13 KiB {0} [built]
| ./react/features/stream-effects/rnnoise/index.js 621 bytes [built]
| ./react/features/stream-effects/rnnoise/RnnoiseProcessor.js 5.52 KiB [built]
+ 2 hidden modules
Child
Hash: a53a85a5b01aee32a0f6
Time: 14952ms
Built at: 10/02/2020 1:24:42 PM
Asset Size Chunks Chunk Names
external_api.min.js 27.9 KiB 0 [emitted] external_api
external_api.min.map 150 KiB 0 [emitted] [dev] external_api
Entrypoint external_api = external_api.min.js external_api.min.map
[0] ./modules/API/external/functions.js 3.96 KiB {0} [built]
[4] ./modules/API/external/electronPopupsConfig.json 285 bytes {0} [built]
[6] ./modules/API/external/index.js 171 bytes {0} [built]
[8] ./modules/API/external/external_api.js + 15 modules 67.6 KiB {0} [built]
| ./modules/API/external/external_api.js 32.4 KiB [built]
| ./react/features/base/util/uri.js 16.2 KiB [built]
| ./modules/transport/index.js 1.27 KiB [built]
| ./react/features/base/util/parseURLParams.js 1.46 KiB [built]
| ./react/features/base/util/strings.web.js 240 bytes [built]
| ./react/features/base/util/index.js 178 bytes [built]
| ./modules/API/constants.js 768 bytes [built]
| ./react/features/base/util/helpers.js 2.93 KiB [built]
| ./react/features/base/util/httpUtils.js 1.06 KiB [built]
| ./react/features/base/util/loadScript.web.js 555 bytes [built]
| ./react/features/base/util/openURLInBrowser.web.js 326 bytes [built]
| ./react/features/base/util/timeoutPromise.js 1.06 KiB [built]
| + 4 hidden modules
+ 5 hidden modules
rm -fr libs
mkdir -p libs
cp
build/app.bundle.min.js
build/app.bundle.min.map
build/do_external_connect.min.js
build/do_external_connect.min.map
build/external_api.min.js
build/external_api.min.map
build/flacEncodeWorker.min.js
build/flacEncodeWorker.min.map
build/device_selection_popup_bundle.min.js
build/device_selection_popup_bundle.min.map
build/dial_in_info_bundle.min.js
build/dial_in_info_bundle.min.map
build/alwaysontop.min.js
build/alwaysontop.min.map
./analytics-ga.js
build/analytics-ga.min.js
build/analytics-ga.min.map
build/video-blur-effect.min.js
build/video-blur-effect.min.map
build/rnnoise-processor.min.js
build/rnnoise-processor.min.map
build/close3.min.js
build/close3.min.map
libs
cp
node_modules/rnnoise-wasm/dist//rnnoise.wasm
libs
cp
node_modules/lib-jitsi-meet//lib-jitsi-meet.min.js
node_modules/lib-jitsi-meet//lib-jitsi-meet.min.map
node_modules/lib-jitsi-meet//lib-jitsi-meet.e2ee-worker.js
node_modules/lib-jitsi-meet//connection_optimization/external_connect.js
node_modules/lib-jitsi-meet//modules/browser/capabilities.json
libs
cp: cannot stat ‘node_modules/lib-jitsi-meet//lib-jitsi-meet.min.js’: No such file or directory
cp: cannot stat ‘node_modules/lib-jitsi-meet//lib-jitsi-meet.min.map’: No such file or directory
cp: cannot stat ‘node_modules/lib-jitsi-meet//lib-jitsi-meet.e2ee-worker.js’: No such file or directory
Makefile:60: recipe for target ‘deploy-lib-jitsi-meet’ failed
make: *** [deploy-lib-jitsi-meet] Error 1

Try deleting node_modules folder and run again npm install

ok , but I have tried that also , is there any other solution

lib-jitsi-meet is build when doing npm install, I don’t see how it succeeds and there is nothing built

yes I have tried this, so now below error message coming after this command ubuntu@ip-172-31-47-13:/usr/share/UnMuteJitsiCode$ sudo npm install

Error: EACCES: permission denied, open '/usr/share/UnMuteJitsiCode/node_modules/lib-jitsi-meet/lib-jitsi-meet.e2ee-worker.j

You should not do those commands using sudo.

ok without sudo below below output comes
npm WARN checkPermissions Missing write access to /usr/share/UnMuteJitsiCode/node_modules
npm WARN checkPermissions Missing write access to /usr/share/UnMuteJitsiCode/node_modules/chokidar/node_modules
npm WARN checkPermissions Missing write access to /usr/share/UnMuteJitsiCode/node_modules/@jitsi
npm WARN @atlaskit/inline-dialog@5.3.0 requires a peer of react@15.6.0 - 16.2.0 but none is installed. You must install peer dependencies yourself.
npm WARN @atlaskit/inline-dialog@5.3.0 requires a peer of react-dom@15.6.0 - 16.2.0 but none is installed. You must install peer dependencies yourself.
npm WARN @atlaskit/layer@2.9.1 requires a peer of react@15.6.0 - 16.2.0 but none is installed. You must install peer dependencies yourself.
npm WARN @atlaskit/theme@2.4.1 requires a peer of react@15.6.0 - 16.2.0 but none is installed. You must install peer dependencies yourself.
npm WARN @react-native-community/async-storage@1.3.4 requires a peer of react-native@>=0.57 but none is installed. You must install peer dependencies yourself.
npm WARN @react-native-community/netinfo@4.1.5 requires a peer of react-native@>=0.59 but none is installed. You must install peer dependencies yourself.
npm WARN ajv-keywords@3.2.0 requires a peer of ajv@^6.0.0 but none is installed. You must install peer dependencies yourself.
npm WARN @react-native-community/cli@3.2.0 requires a peer of react-native@^0.61.0 but none is installed. You must install peer dependencies yourself.
npm WARN react-native-background-timer@2.4.0 requires a peer of react-native@>=0.47.0 but none is installed. You must install peer dependencies yourself.
npm WARN react-native-calendar-events@2.0.0 requires a peer of react-native@>=0.40.0 but none is installed. You must install peer dependencies yourself.
npm WARN react-native-default-preference@1.4.2 requires a peer of react-native@>=0.47.0 but none is installed. You must install peer dependencies yourself.
npm WARN react-native-immersive@2.0.0 requires a peer of react-native@>=0.47.0 but none is installed. You must install peer dependencies yourself.
npm WARN react-native-linear-gradient@2.5.6 requires a peer of react-native@>=0.55 but none is installed. You must install peer dependencies yourself.
npm WARN react-native-sound@0.11.0 requires a peer of react-native@>=0.8.0 but none is installed. You must install peer dependencies yourself.
npm WARN react-native-svg@9.7.1 requires a peer of react-native@>=0.50.0 but none is installed. You must install peer dependencies yourself.
npm WARN react-native-svg-transformer@0.13.0 requires a peer of react-native@>=0.45.0 but none is installed. You must install peer dependencies yourself.
npm WARN react-native-watch-connectivity@0.4.3 requires a peer of react-native@>=0.40 but none is installed. You must install peer dependencies yourself.
npm WARN react-native-webrtc@1.84.0 requires a peer of react-native@>=0.40.0 but none is installed. You must install peer dependencies yourself.
npm WARN react-native-webview@7.4.1 requires a peer of react-native@>=0.60 <0.62 but none is installed. You must install peer dependencies yourself.
npm WARN react-native-youtube-iframe@1.2.3 requires a peer of react-native@>=0.59 but none is installed. You must install peer dependencies yourself.
npm WARN react-native-youtube-iframe@1.2.3 requires a peer of react-native-webview@^7.5.2 but none is installed. You must install peer dependencies yourself.

npm ERR! code EACCES
npm ERR! syscall access
npm ERR! path /usr/share/UnMuteJitsiCode/node_modules
npm ERR! errno -13
npm ERR! Error: EACCES: permission denied, access ‘/usr/share/UnMuteJitsiCode/node_modules’
npm ERR! [Error: EACCES: permission denied, access ‘/usr/share/UnMuteJitsiCode/node_modules’] {
npm ERR! errno: -13,
npm ERR! code: ‘EACCES’,
npm ERR! syscall: ‘access’,
npm ERR! path: ‘/usr/share/UnMuteJitsiCode/node_modules’
npm ERR! }
npm ERR!
npm ERR! The operation was rejected by your operating system.
npm ERR! It is likely you do not have the permissions to access this file as the current user
npm ERR!
npm ERR! If you believe this might be a permissions issue, please double-check the
npm ERR! permissions of the file and its containing directories, or try running
npm ERR! the command again as root/Administrator.

npm ERR! A complete log of this run can be found in:
npm ERR! /home/ubuntu/.npm/_logs/2020-10-02T13_44_46_006Z-debug.log

and after npm install have tried below then see the the output
ubuntu@ip-172-31-47-13:/usr/share/UnMuteJitsiCode$ make
./node_modules/.bin/webpack -p
Error: EACCES: permission denied, open ‘/usr/share/UnMuteJitsiCode/build/close3.min.js’
Browserslist: caniuse-lite is outdated. Please run next command npm update
Makefile:20: recipe for target ‘compile’ failed
make: *** [compile] Error 1

Delete node_modules and any files owned by root and start over.
You are getting permission problems on files.