Assertion Error at PriorityNode.removeChild

meet

#1

Getting this assertion randomly while using dev environment for jitsi-meet. Any ideas what might be the cause or how to avoid this?
Thanks.

assert.js:42
throw new errors.AssertionError({
^
AssertionError [ERR_ASSERTION]: false == true
at PriorityNode.removeChild (/home/mmoanis/Desktop/jitsi-meet/node_modules/spdy-transport/lib/spdy-transport/priority.js:74:3)
at PriorityNode.remove (/home/mmoanis/Desktop/jitsi-meet/node_modules/spdy-transport/lib/spdy-transport/priority.js:62:15)
at PriorityTree.add (/home/mmoanis/Desktop/jitsi-meet/node_modules/spdy-transport/lib/spdy-transport/priority.js:163:23)
at Stream._initPriority (/home/mmoanis/Desktop/jitsi-meet/node_modules/spdy-transport/lib/spdy-transport/stream.js:101:25)
at new Stream (/home/mmoanis/Desktop/jitsi-meet/node_modules/spdy-transport/lib/spdy-transport/stream.js:76:8)
at Connection._createStream (/home/mmoanis/Desktop/jitsi-meet/node_modules/spdy-transport/lib/spdy-transport/connection.js:388:16)
at Connection._handleHeaders (/home/mmoanis/Desktop/jitsi-meet/node_modules/spdy-transport/lib/spdy-transport/connection.js:436:21)
at Connection._handleFrame (/home/mmoanis/Desktop/jitsi-meet/node_modules/spdy-transport/lib/spdy-transport/connection.js:319:10)
at Parser.<anonymous> (/home/mmoanis/Desktop/jitsi-meet/node_modules/spdy-transport/lib/spdy-transport/connection.js:156:10)
at emitOne (events.js:116:13)
at Parser.emit (events.js:211:7)
at addChunk (/home/mmoanis/Desktop/jitsi-meet/node_modules/spdy-transport/node_modules/readable-stream/lib/_stream_readable.js:291:12)
at readableAddChunk (/home/mmoanis/Desktop/jitsi-meet/node_modules/spdy-transport/node_modules/readable-stream/lib/_stream_readable.js:278:11)
at Parser.Readable.push (/home/mmoanis/Desktop/jitsi-meet/node_modules/spdy-transport/node_modules/readable-stream/lib/_stream_readable.js:245:10)
at Parser.Transform.push (/home/mmoanis/Desktop/jitsi-meet/node_modules/spdy-transport/node_modules/readable-stream/lib/_stream_transform.js:148:32)
at next (/home/mmoanis/Desktop/jitsi-meet/node_modules/spdy-transport/lib/spdy-transport/protocol/base/parser.js:53:12)
Makefile:71: recipe for target 'dev' failed
make: *** [dev] Error 1

#2

More information: